Run| Workspace| Log| Issues| Fixes| Pre-reqs| Stats| XRef| Maven Repository Proxy Log Gump Logo

Details

File Contents

Testsuite: org.apache.catalina.core.TestStandardContext
Tests run: 24, Failures: 0, Errors: 0, Skipped: 0, Time elapsed: 4.976 sec
------------- Standard Error -----------------
24-May-2018 21:45:08.473 INFO [main] org.apache.catalina.startup.LoggingBaseTest.setUp Starting test case [testTldListener]
24-May-2018 21:45:08.996 INFO [main] org.apache.coyote.AbstractProtocol.init Initializing ProtocolHandler ["http-nio2-127.0.0.1-auto-1"]
24-May-2018 21:45:09.085 INFO [main] org.apache.catalina.core.StandardService.startInternal Starting service [Tomcat]
24-May-2018 21:45:09.086 INFO [main] org.apache.catalina.core.StandardEngine.startInternal Starting Servlet Engine: Apache Tomcat/9.0.9-dev
24-May-2018 21:45:09.218 INFO [main] org.apache.jasper.servlet.TldScanner.scanJars At least one JAR was scanned for TLDs yet contained no TLDs. Enable debug logging for this logger for a complete list of JARs that were scanned but no TLDs were found in them. Skipping unneeded JARs during scanning can improve startup time and JSP compilation time.
24-May-2018 21:45:09.235 INFO [main] org.apache.coyote.AbstractProtocol.start Starting ProtocolHandler ["http-nio2-127.0.0.1-auto-1-52552"]
24-May-2018 21:45:09.244 INFO [main] org.apache.coyote.AbstractProtocol.pause Pausing ProtocolHandler ["http-nio2-127.0.0.1-auto-1-52552"]
24-May-2018 21:45:09.298 INFO [main] org.apache.catalina.core.StandardService.stopInternal Stopping service [Tomcat]
24-May-2018 21:45:09.299 INFO [main] org.apache.coyote.AbstractProtocol.stop Stopping ProtocolHandler ["http-nio2-127.0.0.1-auto-1-52552"]
24-May-2018 21:45:09.299 INFO [main] org.apache.coyote.AbstractProtocol.destroy Destroying ProtocolHandler ["http-nio2-127.0.0.1-auto-1-52552"]
24-May-2018 21:45:09.317 INFO [main] org.apache.catalina.startup.LoggingBaseTest.setUp Starting test case [testWebappListenerConfigureFail]
24-May-2018 21:45:09.326 INFO [main] org.apache.coyote.AbstractProtocol.init Initializing ProtocolHandler ["http-nio2-127.0.0.1-auto-2"]
24-May-2018 21:45:09.330 INFO [main] org.apache.catalina.core.StandardService.startInternal Starting service [Tomcat]
24-May-2018 21:45:09.330 INFO [main] org.apache.catalina.core.StandardEngine.startInternal Starting Servlet Engine: Apache Tomcat/9.0.9-dev
24-May-2018 21:45:09.332 INFO [main] org.apache.coyote.AbstractProtocol.start Starting ProtocolHandler ["http-nio2-127.0.0.1-auto-2-46781"]
24-May-2018 21:45:09.390 INFO [main] org.apache.catalina.startup.ContextConfig.getDefaultWebXmlFragment No global web.xml found
24-May-2018 21:45:10.998 INFO [main] org.apache.coyote.AbstractProtocol.pause Pausing ProtocolHandler ["http-nio2-127.0.0.1-auto-2-46781"]
24-May-2018 21:45:11.049 INFO [main] org.apache.catalina.core.StandardService.stopInternal Stopping service [Tomcat]
24-May-2018 21:45:11.054 INFO [main] org.apache.coyote.AbstractProtocol.stop Stopping ProtocolHandler ["http-nio2-127.0.0.1-auto-2-46781"]
24-May-2018 21:45:11.054 INFO [main] org.apache.coyote.AbstractProtocol.destroy Destroying ProtocolHandler ["http-nio2-127.0.0.1-auto-2-46781"]
24-May-2018 21:45:11.064 INFO [main] org.apache.catalina.startup.LoggingBaseTest.setUp Starting test case [testDenyUncoveredHttpMethodsSCITrue]
24-May-2018 21:45:11.071 INFO [main] org.apache.coyote.AbstractProtocol.init Initializing ProtocolHandler ["http-nio2-127.0.0.1-auto-3"]
24-May-2018 21:45:11.078 INFO [main] org.apache.catalina.core.StandardService.startInternal Starting service [Tomcat]
24-May-2018 21:45:11.078 INFO [main] org.apache.catalina.core.StandardEngine.startInternal Starting Servlet Engine: Apache Tomcat/9.0.9-dev
24-May-2018 21:45:11.094 INFO [main] org.apache.tomcat.util.descriptor.web.SecurityConstraint.findUncoveredHttpMethods Adding security constraints with URL pattern [/test] to deny access with the uncovered HTTP methods that are not one of the following [POST]
24-May-2018 21:45:11.098 INFO [main] org.apache.coyote.AbstractProtocol.start Starting ProtocolHandler ["http-nio2-127.0.0.1-auto-3-42178"]
24-May-2018 21:45:11.105 INFO [main] org.apache.coyote.AbstractProtocol.pause Pausing ProtocolHandler ["http-nio2-127.0.0.1-auto-3-42178"]
24-May-2018 21:45:11.155 INFO [main] org.apache.catalina.core.StandardService.stopInternal Stopping service [Tomcat]
24-May-2018 21:45:11.158 INFO [main] org.apache.coyote.AbstractProtocol.stop Stopping ProtocolHandler ["http-nio2-127.0.0.1-auto-3-42178"]
24-May-2018 21:45:11.158 INFO [main] org.apache.coyote.AbstractProtocol.destroy Destroying ProtocolHandler ["http-nio2-127.0.0.1-auto-3-42178"]
24-May-2018 21:45:11.165 INFO [main] org.apache.catalina.startup.LoggingBaseTest.setUp Starting test case [testAddPostConstructMethodNullClassName]
24-May-2018 21:45:11.166 INFO [main] org.apache.coyote.AbstractProtocol.destroy Destroying ProtocolHandler ["http-nio2-127.0.0.1-auto-4"]
24-May-2018 21:45:11.168 INFO [main] org.apache.catalina.startup.LoggingBaseTest.setUp Starting test case [testAddPreDestroyMethodConflicts]
24-May-2018 21:45:11.169 INFO [main] org.apache.coyote.AbstractProtocol.destroy Destroying ProtocolHandler ["http-nio2-127.0.0.1-auto-5"]
24-May-2018 21:45:11.171 INFO [main] org.apache.catalina.startup.LoggingBaseTest.setUp Starting test case [testBug46243]
24-May-2018 21:45:11.175 INFO [main] org.apache.coyote.AbstractProtocol.init Initializing ProtocolHandler ["http-nio2-127.0.0.1-auto-6"]
24-May-2018 21:45:11.177 INFO [main] org.apache.catalina.core.StandardService.startInternal Starting service [Tomcat]
24-May-2018 21:45:11.177 INFO [main] org.apache.catalina.core.StandardEngine.startInternal Starting Servlet Engine: Apache Tomcat/9.0.9-dev
24-May-2018 21:45:11.189 SEVERE [main] org.apache.catalina.core.StandardContext.filterStart Exception starting filter [Bug46243]
 javax.servlet.ServletException: Init fail (test)
	at org.apache.catalina.core.TestStandardContext$Bug46243Filter.init(TestStandardContext.java:176)
	at javax.servlet.GenericFilter.init(GenericFilter.java:61)
	at org.apache.catalina.core.ApplicationFilterConfig.initFilter(ApplicationFilterConfig.java:277)
	at org.apache.catalina.core.ApplicationFilterConfig.getFilter(ApplicationFilterConfig.java:258)
	at org.apache.catalina.core.ApplicationFilterConfig.<init>(ApplicationFilterConfig.java:104)
	at org.apache.catalina.core.StandardContext.filterStart(StandardContext.java:4491)
	at org.apache.catalina.core.StandardContext.startInternal(StandardContext.java:5135)
	at org.apache.catalina.util.LifecycleBase.start(LifecycleBase.java:183)
	at org.apache.catalina.core.ContainerBase$StartChild.call(ContainerBase.java:1427)
	at org.apache.catalina.core.ContainerBase$StartChild.call(ContainerBase.java:1417)
	at java.util.concurrent.FutureTask.run(FutureTask.java:266)
	at org.apache.tomcat.util.threads.InlineExecutorService.execute(InlineExecutorService.java:75)
	at java.util.concurrent.AbstractExecutorService.submit(AbstractExecutorService.java:134)
	at org.apache.catalina.core.ContainerBase.startInternal(ContainerBase.java:943)
	at org.apache.catalina.core.StandardHost.startInternal(StandardHost.java:839)
	at org.apache.catalina.util.LifecycleBase.start(LifecycleBase.java:183)
	at org.apache.catalina.core.ContainerBase$StartChild.call(ContainerBase.java:1427)
	at org.apache.catalina.core.ContainerBase$StartChild.call(ContainerBase.java:1417)
	at java.util.concurrent.FutureTask.run(FutureTask.java:266)
	at org.apache.tomcat.util.threads.InlineExecutorService.execute(InlineExecutorService.java:75)
	at java.util.concurrent.AbstractExecutorService.submit(AbstractExecutorService.java:134)
	at org.apache.catalina.core.ContainerBase.startInternal(ContainerBase.java:943)
	at org.apache.catalina.core.StandardEngine.startInternal(StandardEngine.java:258)
	at org.apache.catalina.util.LifecycleBase.start(LifecycleBase.java:183)
	at org.apache.catalina.core.StandardService.startInternal(StandardService.java:422)
	at org.apache.catalina.util.LifecycleBase.start(LifecycleBase.java:183)
	at org.apache.catalina.core.StandardServer.startInternal(StandardServer.java:770)
	at org.apache.catalina.util.LifecycleBase.start(LifecycleBase.java:183)
	at org.apache.catalina.startup.Tomcat.start(Tomcat.java:371)
	at org.apache.catalina.startup.TomcatBaseTest$TomcatWithFastSessionIDs.start(TomcatBaseTest.java:845)
	at org.apache.catalina.core.TestStandardContext.testBug46243(TestStandardContext.java:100)
	at sun.reflect.NativeMethodAccessorImpl.invoke0(Native Method)
	at sun.reflect.NativeMethodAccessorImpl.invoke(NativeMethodAccessorImpl.java:62)
	at sun.reflect.DelegatingMethodAccessorImpl.invoke(DelegatingMethodAccessorImpl.java:43)
	at java.lang.reflect.Method.invoke(Method.java:498)
	at org.junit.runners.model.FrameworkMethod$1.runReflectiveCall(FrameworkMethod.java:59)
	at org.junit.internal.runners.model.ReflectiveCallable.run(ReflectiveCallable.java:12)
	at org.junit.runners.model.FrameworkMethod.invokeExplosively(FrameworkMethod.java:61)
	at org.junit.internal.runners.statements.InvokeMethod.evaluate(InvokeMethod.java:17)
	at org.junit.internal.runners.statements.RunBefores.evaluate(RunBefores.java:26)
	at org.junit.internal.runners.statements.RunAfters.evaluate(RunAfters.java:27)
	at org.junit.rules.TestWatcher$1.evaluate(TestWatcher.java:61)
	at org.junit.runners.BlockJUnit4ClassRunner$1.evaluate(BlockJUnit4ClassRunner.java:100)
	at org.junit.runners.ParentRunner.runLeaf(ParentRunner.java:346)
	at org.junit.runners.BlockJUnit4ClassRunner.runChild(BlockJUnit4ClassRunner.java:103)
	at org.junit.runners.BlockJUnit4ClassRunner.runChild(BlockJUnit4ClassRunner.java:63)
	at org.junit.runners.ParentRunner$3.run(ParentRunner.java:311)
	at org.junit.runners.ParentRunner$1.schedule(ParentRunner.java:76)
	at org.junit.runners.ParentRunner.runChildren(ParentRunner.java:309)
	at org.junit.runners.ParentRunner.access$100(ParentRunner.java:63)
	at org.junit.runners.ParentRunner$2.evaluate(ParentRunner.java:289)
	at org.junit.internal.runners.statements.RunBefores.evaluate(RunBefores.java:26)
	at org.junit.internal.runners.statements.RunAfters.evaluate(RunAfters.java:27)
	at org.junit.runners.ParentRunner.run(ParentRunner.java:393)
	at junit.framework.JUnit4TestAdapter.run(JUnit4TestAdapter.java:48)
	at org.apache.tools.ant.taskdefs.optional.junit.JUnitTestRunner.run(JUnitTestRunner.java:534)
	at org.apache.tools.ant.taskdefs.optional.junit.JUnitTestRunner.launch(JUnitTestRunner.java:1196)
	at org.apache.tools.ant.taskdefs.optional.junit.JUnitTestRunner.main(JUnitTestRunner.java:1041)
Caused by: java.lang.ClassNotFoundException
	... 58 more

24-May-2018 21:45:11.192 SEVERE [main] org.apache.catalina.core.StandardContext.startInternal One or more Filters failed to start. Full details will be found in the appropriate container log file
24-May-2018 21:45:11.192 SEVERE [main] org.apache.catalina.core.StandardContext.startInternal Context [] startup failed due to previous errors
24-May-2018 21:45:11.198 INFO [main] org.apache.coyote.AbstractProtocol.start Starting ProtocolHandler ["http-nio2-127.0.0.1-auto-6-34758"]
24-May-2018 21:45:11.210 INFO [main] org.apache.coyote.AbstractProtocol.pause Pausing ProtocolHandler ["http-nio2-127.0.0.1-auto-6-34758"]
24-May-2018 21:45:11.211 INFO [main] org.apache.catalina.core.StandardService.stopInternal Stopping service [Tomcat]
24-May-2018 21:45:11.213 INFO [main] org.apache.coyote.AbstractProtocol.stop Stopping ProtocolHandler ["http-nio2-127.0.0.1-auto-6-34758"]
24-May-2018 21:45:11.216 INFO [main] org.apache.coyote.AbstractProtocol.destroy Destroying ProtocolHandler ["http-nio2-127.0.0.1-auto-6-34758"]
24-May-2018 21:45:11.239 INFO [main] org.apache.catalina.startup.LoggingBaseTest.setUp Starting test case [testBug49711]
24-May-2018 21:45:11.243 INFO [main] org.apache.coyote.AbstractProtocol.init Initializing ProtocolHandler ["http-nio2-127.0.0.1-auto-7"]
24-May-2018 21:45:11.246 INFO [main] org.apache.catalina.core.StandardService.startInternal Starting service [Tomcat]
24-May-2018 21:45:11.246 INFO [main] org.apache.catalina.core.StandardEngine.startInternal Starting Servlet Engine: Apache Tomcat/9.0.9-dev
24-May-2018 21:45:11.257 INFO [main] org.apache.coyote.AbstractProtocol.start Starting ProtocolHandler ["http-nio2-127.0.0.1-auto-7-48438"]
24-May-2018 21:45:11.270 SEVERE [http-nio2-127.0.0.1-auto-7-exec-2] org.apache.catalina.core.StandardWrapperValve.invoke Servlet.service() for servlet [regular] in context with path [] threw exception
 java.lang.IllegalStateException: Unable to process parts as no multi-part configuration has been provided
	at org.apache.catalina.connector.Request.parseParts(Request.java:2762)
	at org.apache.catalina.connector.Request.getParts(Request.java:2728)
	at org.apache.catalina.connector.RequestFacade.getParts(RequestFacade.java:1098)
	at org.apache.catalina.core.TestStandardContext$Bug49711Servlet.service(TestStandardContext.java:704)
	at javax.servlet.http.HttpServlet.service(HttpServlet.java:741)
	at org.apache.catalina.core.ApplicationFilterChain.internalDoFilter(ApplicationFilterChain.java:231)
	at org.apache.catalina.core.ApplicationFilterChain.doFilter(ApplicationFilterChain.java:166)
	at org.apache.catalina.core.StandardWrapperValve.invoke(StandardWrapperValve.java:199)
	at org.apache.catalina.core.StandardContextValve.invoke(StandardContextValve.java:96)
	at org.apache.catalina.authenticator.AuthenticatorBase.invoke(AuthenticatorBase.java:494)
	at org.apache.catalina.core.StandardHostValve.invoke(StandardHostValve.java:139)
	at org.apache.catalina.valves.ErrorReportValve.invoke(ErrorReportValve.java:92)
	at org.apache.catalina.valves.AbstractAccessLogValve.invoke(AbstractAccessLogValve.java:668)
	at org.apache.catalina.core.StandardEngineValve.invoke(StandardEngineValve.java:87)
	at org.apache.catalina.connector.CoyoteAdapter.service(CoyoteAdapter.java:343)
	at org.apache.coyote.http11.Http11Processor.service(Http11Processor.java:408)
	at org.apache.coyote.AbstractProcessorLight.process(AbstractProcessorLight.java:66)
	at org.apache.coyote.AbstractProtocol$ConnectionHandler.process(AbstractProtocol.java:754)
	at org.apache.tomcat.util.net.Nio2Endpoint$SocketProcessor.doRun(Nio2Endpoint.java:1680)
	at org.apache.tomcat.util.net.SocketProcessorBase.run(SocketProcessorBase.java:49)
	at org.apache.tomcat.util.net.AbstractEndpoint.processSocket(AbstractEndpoint.java:1007)
	at org.apache.tomcat.util.net.Nio2Endpoint$Nio2SocketWrapper$4.completed(Nio2Endpoint.java:540)
	at org.apache.tomcat.util.net.Nio2Endpoint$Nio2SocketWrapper$4.completed(Nio2Endpoint.java:518)
	at sun.nio.ch.Invoker.invokeUnchecked(Invoker.java:126)
	at sun.nio.ch.Invoker$2.run(Invoker.java:218)
	at sun.nio.ch.AsynchronousChannelGroupImpl$1.run(AsynchronousChannelGroupImpl.java:112)
	at java.util.concurrent.ThreadPoolExecutor.runWorker(ThreadPoolExecutor.java:1149)
	at java.util.concurrent.ThreadPoolExecutor$Worker.run(ThreadPoolExecutor.java:624)
	at org.apache.tomcat.util.threads.TaskThread$WrappingRunnable.run(TaskThread.java:61)
	at java.lang.Thread.run(Thread.java:748)

24-May-2018 21:45:11.305 SEVERE [http-nio2-127.0.0.1-auto-7-exec-6] org.apache.catalina.core.StandardWrapperValve.invoke Servlet.service() for servlet [regular] in context with path [] threw exception
 java.lang.IllegalStateException: Unable to process parts as no multi-part configuration has been provided
	at org.apache.catalina.connector.Request.parseParts(Request.java:2762)
	at org.apache.catalina.connector.Request.getParts(Request.java:2728)
	at org.apache.catalina.connector.RequestFacade.getParts(RequestFacade.java:1098)
	at org.apache.catalina.core.TestStandardContext$Bug49711Servlet.service(TestStandardContext.java:704)
	at javax.servlet.http.HttpServlet.service(HttpServlet.java:741)
	at org.apache.catalina.core.ApplicationFilterChain.internalDoFilter(ApplicationFilterChain.java:231)
	at org.apache.catalina.core.ApplicationFilterChain.doFilter(ApplicationFilterChain.java:166)
	at org.apache.catalina.core.StandardWrapperValve.invoke(StandardWrapperValve.java:199)
	at org.apache.catalina.core.StandardContextValve.invoke(StandardContextValve.java:96)
	at org.apache.catalina.authenticator.AuthenticatorBase.invoke(AuthenticatorBase.java:494)
	at org.apache.catalina.core.StandardHostValve.invoke(StandardHostValve.java:139)
	at org.apache.catalina.valves.ErrorReportValve.invoke(ErrorReportValve.java:92)
	at org.apache.catalina.valves.AbstractAccessLogValve.invoke(AbstractAccessLogValve.java:668)
	at org.apache.catalina.core.StandardEngineValve.invoke(StandardEngineValve.java:87)
	at org.apache.catalina.connector.CoyoteAdapter.service(CoyoteAdapter.java:343)
	at org.apache.coyote.http11.Http11Processor.service(Http11Processor.java:408)
	at org.apache.coyote.AbstractProcessorLight.process(AbstractProcessorLight.java:66)
	at org.apache.coyote.AbstractProtocol$ConnectionHandler.process(AbstractProtocol.java:754)
	at org.apache.tomcat.util.net.Nio2Endpoint$SocketProcessor.doRun(Nio2Endpoint.java:1680)
	at org.apache.tomcat.util.net.SocketProcessorBase.run(SocketProcessorBase.java:49)
	at org.apache.tomcat.util.net.AbstractEndpoint.processSocket(AbstractEndpoint.java:1007)
	at org.apache.tomcat.util.net.Nio2Endpoint$Nio2SocketWrapper$4.completed(Nio2Endpoint.java:540)
	at org.apache.tomcat.util.net.Nio2Endpoint$Nio2SocketWrapper$4.completed(Nio2Endpoint.java:518)
	at sun.nio.ch.Invoker.invokeUnchecked(Invoker.java:126)
	at sun.nio.ch.Invoker$2.run(Invoker.java:218)
	at sun.nio.ch.AsynchronousChannelGroupImpl$1.run(AsynchronousChannelGroupImpl.java:112)
	at java.util.concurrent.ThreadPoolExecutor.runWorker(ThreadPoolExecutor.java:1149)
	at java.util.concurrent.ThreadPoolExecutor$Worker.run(ThreadPoolExecutor.java:624)
	at org.apache.tomcat.util.threads.TaskThread$WrappingRunnable.run(TaskThread.java:61)
	at java.lang.Thread.run(Thread.java:748)

24-May-2018 21:45:11.312 INFO [main] org.apache.coyote.AbstractProtocol.pause Pausing ProtocolHandler ["http-nio2-127.0.0.1-auto-7-48438"]
24-May-2018 21:45:11.362 INFO [main] org.apache.catalina.core.StandardService.stopInternal Stopping service [Tomcat]
24-May-2018 21:45:11.365 INFO [main] org.apache.coyote.AbstractProtocol.stop Stopping ProtocolHandler ["http-nio2-127.0.0.1-auto-7-48438"]
24-May-2018 21:45:11.366 INFO [main] org.apache.coyote.AbstractProtocol.destroy Destroying ProtocolHandler ["http-nio2-127.0.0.1-auto-7-48438"]
24-May-2018 21:45:11.375 INFO [main] org.apache.catalina.startup.LoggingBaseTest.setUp Starting test case [testBug49922]
24-May-2018 21:45:11.379 INFO [main] org.apache.coyote.AbstractProtocol.init Initializing ProtocolHandler ["http-nio2-127.0.0.1-auto-8"]
24-May-2018 21:45:11.382 INFO [main] org.apache.catalina.core.StandardService.startInternal Starting service [Tomcat]
24-May-2018 21:45:11.383 INFO [main] org.apache.catalina.core.StandardEngine.startInternal Starting Servlet Engine: Apache Tomcat/9.0.9-dev
24-May-2018 21:45:11.391 INFO [main] org.apache.catalina.startup.ContextConfig.getDefaultWebXmlFragment No global web.xml found
24-May-2018 21:45:11.652 INFO [main] org.apache.coyote.AbstractProtocol.start Starting ProtocolHandler ["http-nio2-127.0.0.1-auto-8-53271"]
24-May-2018 21:45:11.691 INFO [main] org.apache.coyote.AbstractProtocol.pause Pausing ProtocolHandler ["http-nio2-127.0.0.1-auto-8-53271"]
24-May-2018 21:45:11.742 INFO [main] org.apache.catalina.core.StandardService.stopInternal Stopping service [Tomcat]
24-May-2018 21:45:11.746 INFO [main] org.apache.coyote.AbstractProtocol.stop Stopping ProtocolHandler ["http-nio2-127.0.0.1-auto-8-53271"]
24-May-2018 21:45:11.746 INFO [main] org.apache.coyote.AbstractProtocol.destroy Destroying ProtocolHandler ["http-nio2-127.0.0.1-auto-8-53271"]
24-May-2018 21:45:11.799 INFO [main] org.apache.catalina.startup.LoggingBaseTest.setUp Starting test case [testBug50015]
24-May-2018 21:45:11.801 INFO [main] org.apache.coyote.AbstractProtocol.init Initializing ProtocolHandler ["http-nio2-127.0.0.1-auto-9"]

Continuation...

24-May-2018 21:45:11.806 INFO [main] org.apache.catalina.core.StandardService.startInternal Starting service [Tomcat]
24-May-2018 21:45:11.806 INFO [main] org.apache.catalina.core.StandardEngine.startInternal Starting Servlet Engine: Apache Tomcat/9.0.9-dev
24-May-2018 21:45:11.810 INFO [main] org.apache.coyote.AbstractProtocol.start Starting ProtocolHandler ["http-nio2-127.0.0.1-auto-9-49076"]
24-May-2018 21:45:11.816 INFO [main] org.apache.coyote.AbstractProtocol.pause Pausing ProtocolHandler ["http-nio2-127.0.0.1-auto-9-49076"]
24-May-2018 21:45:11.866 INFO [main] org.apache.catalina.core.StandardService.stopInternal Stopping service [Tomcat]
24-May-2018 21:45:11.868 INFO [main] org.apache.coyote.AbstractProtocol.stop Stopping ProtocolHandler ["http-nio2-127.0.0.1-auto-9-49076"]
24-May-2018 21:45:11.869 INFO [main] org.apache.coyote.AbstractProtocol.destroy Destroying ProtocolHandler ["http-nio2-127.0.0.1-auto-9-49076"]
24-May-2018 21:45:11.871 INFO [main] org.apache.catalina.startup.LoggingBaseTest.setUp Starting test case [testBug56085]
24-May-2018 21:45:11.872 INFO [main] org.apache.coyote.AbstractProtocol.init Initializing ProtocolHandler ["http-nio2-127.0.0.1-auto-10"]
24-May-2018 21:45:11.874 INFO [main] org.apache.catalina.core.StandardService.startInternal Starting service [Tomcat]
24-May-2018 21:45:11.874 INFO [main] org.apache.catalina.core.StandardEngine.startInternal Starting Servlet Engine: Apache Tomcat/9.0.9-dev
24-May-2018 21:45:11.880 INFO [main] org.apache.catalina.startup.ContextConfig.getDefaultWebXmlFragment No global web.xml found
24-May-2018 21:45:11.983 INFO [main] org.apache.coyote.AbstractProtocol.start Starting ProtocolHandler ["http-nio2-127.0.0.1-auto-10-39656"]
24-May-2018 21:45:11.984 INFO [main] org.apache.coyote.AbstractProtocol.pause Pausing ProtocolHandler ["http-nio2-127.0.0.1-auto-10-39656"]
24-May-2018 21:45:12.035 INFO [main] org.apache.catalina.core.StandardService.stopInternal Stopping service [Tomcat]
24-May-2018 21:45:12.044 INFO [main] org.apache.coyote.AbstractProtocol.stop Stopping ProtocolHandler ["http-nio2-127.0.0.1-auto-10-39656"]
24-May-2018 21:45:12.044 INFO [main] org.apache.coyote.AbstractProtocol.destroy Destroying ProtocolHandler ["http-nio2-127.0.0.1-auto-10-39656"]
24-May-2018 21:45:12.047 INFO [main] org.apache.catalina.startup.LoggingBaseTest.setUp Starting test case [testBug56903]
24-May-2018 21:45:12.052 INFO [main] org.apache.coyote.AbstractProtocol.destroy Destroying ProtocolHandler ["http-nio2-127.0.0.1-auto-11"]
24-May-2018 21:45:12.052 INFO [main] org.apache.catalina.startup.LoggingBaseTest.setUp Starting test case [testWebappLoaderStartFail]
24-May-2018 21:45:12.054 INFO [main] org.apache.coyote.AbstractProtocol.init Initializing ProtocolHandler ["http-nio2-127.0.0.1-auto-12"]
24-May-2018 21:45:12.057 INFO [main] org.apache.catalina.core.StandardService.startInternal Starting service [Tomcat]
24-May-2018 21:45:12.058 INFO [main] org.apache.catalina.core.StandardEngine.startInternal Starting Servlet Engine: Apache Tomcat/9.0.9-dev
24-May-2018 21:45:12.059 INFO [main] org.apache.coyote.AbstractProtocol.start Starting ProtocolHandler ["http-nio2-127.0.0.1-auto-12-48397"]
24-May-2018 21:45:12.079 INFO [main] org.apache.catalina.startup.ContextConfig.getDefaultWebXmlFragment No global web.xml found
24-May-2018 21:45:12.328 INFO [main] org.apache.coyote.AbstractProtocol.pause Pausing ProtocolHandler ["http-nio2-127.0.0.1-auto-12-48397"]
24-May-2018 21:45:12.379 INFO [main] org.apache.catalina.core.StandardService.stopInternal Stopping service [Tomcat]
24-May-2018 21:45:12.383 INFO [main] org.apache.coyote.AbstractProtocol.stop Stopping ProtocolHandler ["http-nio2-127.0.0.1-auto-12-48397"]
24-May-2018 21:45:12.384 INFO [main] org.apache.coyote.AbstractProtocol.destroy Destroying ProtocolHandler ["http-nio2-127.0.0.1-auto-12-48397"]
24-May-2018 21:45:12.388 INFO [main] org.apache.catalina.startup.LoggingBaseTest.setUp Starting test case [testUncoveredMethods]
24-May-2018 21:45:12.391 INFO [main] org.apache.coyote.AbstractProtocol.init Initializing ProtocolHandler ["http-nio2-127.0.0.1-auto-13"]
24-May-2018 21:45:12.396 INFO [main] org.apache.catalina.core.StandardService.startInternal Starting service [Tomcat]
24-May-2018 21:45:12.396 INFO [main] org.apache.catalina.core.StandardEngine.startInternal Starting Servlet Engine: Apache Tomcat/9.0.9-dev
24-May-2018 21:45:12.410 INFO [main] org.apache.coyote.AbstractProtocol.start Starting ProtocolHandler ["http-nio2-127.0.0.1-auto-13-46236"]
24-May-2018 21:45:12.414 INFO [main] org.apache.coyote.AbstractProtocol.pause Pausing ProtocolHandler ["http-nio2-127.0.0.1-auto-13-46236"]
24-May-2018 21:45:12.465 INFO [main] org.apache.catalina.core.StandardService.stopInternal Stopping service [Tomcat]
24-May-2018 21:45:12.467 INFO [main] org.apache.coyote.AbstractProtocol.stop Stopping ProtocolHandler ["http-nio2-127.0.0.1-auto-13-46236"]
24-May-2018 21:45:12.468 INFO [main] org.apache.coyote.AbstractProtocol.destroy Destroying ProtocolHandler ["http-nio2-127.0.0.1-auto-13-46236"]
24-May-2018 21:45:12.471 INFO [main] org.apache.catalina.startup.LoggingBaseTest.setUp Starting test case [testBug51376a]
24-May-2018 21:45:12.473 INFO [main] org.apache.coyote.AbstractProtocol.init Initializing ProtocolHandler ["http-nio2-127.0.0.1-auto-14"]
24-May-2018 21:45:12.478 INFO [main] org.apache.catalina.core.StandardService.startInternal Starting service [Tomcat]
24-May-2018 21:45:12.479 INFO [main] org.apache.catalina.core.StandardEngine.startInternal Starting Servlet Engine: Apache Tomcat/9.0.9-dev
24-May-2018 21:45:12.483 INFO [main] org.apache.coyote.AbstractProtocol.start Starting ProtocolHandler ["http-nio2-127.0.0.1-auto-14-56763"]
24-May-2018 21:45:12.486 INFO [main] org.apache.coyote.AbstractProtocol.pause Pausing ProtocolHandler ["http-nio2-127.0.0.1-auto-14-56763"]
24-May-2018 21:45:12.486 INFO [main] org.apache.catalina.core.StandardService.stopInternal Stopping service [Tomcat]
24-May-2018 21:45:12.486 INFO [main] org.apache.coyote.AbstractProtocol.stop Stopping ProtocolHandler ["http-nio2-127.0.0.1-auto-14-56763"]
24-May-2018 21:45:12.486 INFO [main] org.apache.coyote.AbstractProtocol.destroy Destroying ProtocolHandler ["http-nio2-127.0.0.1-auto-14-56763"]
24-May-2018 21:45:12.600 INFO [main] org.apache.catalina.startup.LoggingBaseTest.setUp Starting test case [testBug51376b]
24-May-2018 21:45:12.605 INFO [main] org.apache.coyote.AbstractProtocol.init Initializing ProtocolHandler ["http-nio2-127.0.0.1-auto-15"]
24-May-2018 21:45:12.612 INFO [main] org.apache.catalina.core.StandardService.startInternal Starting service [Tomcat]
24-May-2018 21:45:12.612 INFO [main] org.apache.catalina.core.StandardEngine.startInternal Starting Servlet Engine: Apache Tomcat/9.0.9-dev
24-May-2018 21:45:12.621 INFO [main] org.apache.coyote.AbstractProtocol.start Starting ProtocolHandler ["http-nio2-127.0.0.1-auto-15-40365"]
24-May-2018 21:45:12.626 INFO [main] org.apache.coyote.AbstractProtocol.pause Pausing ProtocolHandler ["http-nio2-127.0.0.1-auto-15-40365"]
24-May-2018 21:45:12.677 INFO [main] org.apache.catalina.core.StandardService.stopInternal Stopping service [Tomcat]
24-May-2018 21:45:12.677 INFO [main] org.apache.coyote.AbstractProtocol.stop Stopping ProtocolHandler ["http-nio2-127.0.0.1-auto-15-40365"]
24-May-2018 21:45:12.678 INFO [main] org.apache.coyote.AbstractProtocol.destroy Destroying ProtocolHandler ["http-nio2-127.0.0.1-auto-15-40365"]
24-May-2018 21:45:12.687 INFO [main] org.apache.catalina.startup.LoggingBaseTest.setUp Starting test case [testBug57556a]
24-May-2018 21:45:12.701 INFO [main] org.apache.coyote.AbstractProtocol.init Initializing ProtocolHandler ["http-nio2-127.0.0.1-auto-16"]
24-May-2018 21:45:12.818 INFO [main] org.apache.catalina.core.StandardService.startInternal Starting service [Tomcat]
24-May-2018 21:45:12.818 INFO [main] org.apache.catalina.core.StandardEngine.startInternal Starting Servlet Engine: Apache Tomcat/9.0.9-dev
24-May-2018 21:45:12.836 INFO [main] org.apache.catalina.startup.ContextConfig.getDefaultWebXmlFragment No global web.xml found
24-May-2018 21:45:12.967 INFO [main] org.apache.coyote.AbstractProtocol.start Starting ProtocolHandler ["http-nio2-127.0.0.1-auto-16-46994"]
24-May-2018 21:45:12.970 INFO [main] org.apache.coyote.AbstractProtocol.pause Pausing ProtocolHandler ["http-nio2-127.0.0.1-auto-16-46994"]
24-May-2018 21:45:13.020 INFO [main] org.apache.catalina.core.StandardService.stopInternal Stopping service [Tomcat]
24-May-2018 21:45:13.024 INFO [main] org.apache.coyote.AbstractProtocol.stop Stopping ProtocolHandler ["http-nio2-127.0.0.1-auto-16-46994"]
24-May-2018 21:45:13.025 INFO [main] org.apache.coyote.AbstractProtocol.destroy Destroying ProtocolHandler ["http-nio2-127.0.0.1-auto-16-46994"]
24-May-2018 21:45:13.035 INFO [main] org.apache.catalina.startup.LoggingBaseTest.setUp Starting test case [testBug57556b]
24-May-2018 21:45:13.038 INFO [main] org.apache.coyote.AbstractProtocol.init Initializing ProtocolHandler ["http-nio2-127.0.0.1-auto-17"]
24-May-2018 21:45:13.045 INFO [main] org.apache.catalina.core.StandardService.startInternal Starting service [Tomcat]
24-May-2018 21:45:13.045 INFO [main] org.apache.catalina.core.StandardEngine.startInternal Starting Servlet Engine: Apache Tomcat/9.0.9-dev
24-May-2018 21:45:13.056 INFO [main] org.apache.coyote.AbstractProtocol.start Starting ProtocolHandler ["http-nio2-127.0.0.1-auto-17-47082"]
24-May-2018 21:45:13.057 INFO [main] org.apache.coyote.AbstractProtocol.pause Pausing ProtocolHandler ["http-nio2-127.0.0.1-auto-17-47082"]
24-May-2018 21:45:13.107 INFO [main] org.apache.catalina.core.StandardService.stopInternal Stopping service [Tomcat]
24-May-2018 21:45:13.110 INFO [main] org.apache.coyote.AbstractProtocol.stop Stopping ProtocolHandler ["http-nio2-127.0.0.1-auto-17-47082"]
24-May-2018 21:45:13.110 INFO [main] org.apache.coyote.AbstractProtocol.destroy Destroying ProtocolHandler ["http-nio2-127.0.0.1-auto-17-47082"]
24-May-2018 21:45:13.114 INFO [main] org.apache.catalina.startup.LoggingBaseTest.setUp Starting test case [testFlagFailCtxIfServletStartFails]
24-May-2018 21:45:13.116 INFO [main] org.apache.coyote.AbstractProtocol.init Initializing ProtocolHandler ["http-nio2-127.0.0.1-auto-18"]
24-May-2018 21:45:13.119 INFO [main] org.apache.catalina.core.StandardService.startInternal Starting service [Tomcat]
24-May-2018 21:45:13.120 INFO [main] org.apache.catalina.core.StandardEngine.startInternal Starting Servlet Engine: Apache Tomcat/9.0.9-dev
24-May-2018 21:45:13.129 SEVERE [main] org.apache.catalina.core.StandardContext.loadOnStartup Servlet [myservlet] in web application [] threw load() exception
 javax.servlet.ServletException: failing on purpose
	at org.apache.catalina.core.TestStandardContext$FailingStartupServlet.init(TestStandardContext.java:908)
	at javax.servlet.GenericServlet.init(GenericServlet.java:158)
	at org.apache.catalina.startup.Tomcat$ExistingStandardWrapper.loadServlet(Tomcat.java:1042)
	at org.apache.catalina.core.StandardWrapper.load(StandardWrapper.java:971)
	at org.apache.catalina.core.StandardContext.loadOnStartup(StandardContext.java:4829)
	at org.apache.catalina.core.StandardContext.startInternal(StandardContext.java:5143)
	at org.apache.catalina.util.LifecycleBase.start(LifecycleBase.java:183)
	at org.apache.catalina.core.ContainerBase$StartChild.call(ContainerBase.java:1427)
	at org.apache.catalina.core.ContainerBase$StartChild.call(ContainerBase.java:1417)
	at java.util.concurrent.FutureTask.run(FutureTask.java:266)
	at org.apache.tomcat.util.threads.InlineExecutorService.execute(InlineExecutorService.java:75)
	at java.util.concurrent.AbstractExecutorService.submit(AbstractExecutorService.java:134)
	at org.apache.catalina.core.ContainerBase.startInternal(ContainerBase.java:943)
	at org.apache.catalina.core.StandardHost.startInternal(StandardHost.java:839)
	at org.apache.catalina.util.LifecycleBase.start(LifecycleBase.java:183)
	at org.apache.catalina.core.ContainerBase$StartChild.call(ContainerBase.java:1427)
	at org.apache.catalina.core.ContainerBase$StartChild.call(ContainerBase.java:1417)
	at java.util.concurrent.FutureTask.run(FutureTask.java:266)
	at org.apache.tomcat.util.threads.InlineExecutorService.execute(InlineExecutorService.java:75)
	at java.util.concurrent.AbstractExecutorService.submit(AbstractExecutorService.java:134)
	at org.apache.catalina.core.ContainerBase.startInternal(ContainerBase.java:943)
	at org.apache.catalina.core.StandardEngine.startInternal(StandardEngine.java:258)
	at org.apache.catalina.util.LifecycleBase.start(LifecycleBase.java:183)
	at org.apache.catalina.core.StandardService.startInternal(StandardService.java:422)
	at org.apache.catalina.util.LifecycleBase.start(LifecycleBase.java:183)
	at org.apache.catalina.core.StandardServer.startInternal(StandardServer.java:770)
	at org.apache.catalina.util.LifecycleBase.start(LifecycleBase.java:183)
	at org.apache.catalina.startup.Tomcat.start(Tomcat.java:371)
	at org.apache.catalina.startup.TomcatBaseTest$TomcatWithFastSessionIDs.start(TomcatBaseTest.java:845)
	at org.apache.catalina.core.TestStandardContext.testFlagFailCtxIfServletStartFails(TestStandardContext.java:884)
	at sun.reflect.NativeMethodAccessorImpl.invoke0(Native Method)
	at sun.reflect.NativeMethodAccessorImpl.invoke(NativeMethodAccessorImpl.java:62)
	at sun.reflect.DelegatingMethodAccessorImpl.invoke(DelegatingMethodAccessorImpl.java:43)
	at java.lang.reflect.Method.invoke(Method.java:498)
	at org.junit.runners.model.FrameworkMethod$1.runReflectiveCall(FrameworkMethod.java:59)
	at org.junit.internal.runners.model.ReflectiveCallable.run(ReflectiveCallable.java:12)
	at org.junit.runners.model.FrameworkMethod.invokeExplosively(FrameworkMethod.java:61)
	at org.junit.internal.runners.statements.InvokeMethod.evaluate(InvokeMethod.java:17)
	at org.junit.internal.runners.statements.RunBefores.evaluate(RunBefores.java:26)
	at org.junit.internal.runners.statements.RunAfters.evaluate(RunAfters.java:27)
	at org.junit.rules.TestWatcher$1.evaluate(TestWatcher.java:61)
	at org.junit.runners.BlockJUnit4ClassRunner$1.evaluate(BlockJUnit4ClassRunner.java:100)
	at org.junit.runners.ParentRunner.runLeaf(ParentRunner.java:346)
	at org.junit.runners.BlockJUnit4ClassRunner.runChild(BlockJUnit4ClassRunner.java:103)
	at org.junit.runners.BlockJUnit4ClassRunner.runChild(BlockJUnit4ClassRunner.java:63)
	at org.junit.runners.ParentRunner$3.run(ParentRunner.java:311)
	at org.junit.runners.ParentRunner$1.schedule(ParentRunner.java:76)
	at org.junit.runners.ParentRunner.runChildren(ParentRunner.java:309)
	at org.junit.runners.ParentRunner.access$100(ParentRunner.java:63)
	at org.junit.runners.ParentRunner$2.evaluate(ParentRunner.java:289)
	at org.junit.internal.runners.statements.RunBefores.evaluate(RunBefores.java:26)
	at org.junit.internal.runners.statements.RunAfters.evaluate(RunAfters.java:27)
	at org.junit.runners.ParentRunner.run(ParentRunner.java:393)
	at junit.framework.JUnit4TestAdapter.run(JUnit4TestAdapter.java:48)
	at org.apache.tools.ant.taskdefs.optional.junit.JUnitTestRunner.run(JUnitTestRunner.java:534)
	at org.apache.tools.ant.taskdefs.optional.junit.JUnitTestRunner.launch(JUnitTestRunner.java:1196)
	at org.apache.tools.ant.taskdefs.optional.junit.JUnitTestRunner.main(JUnitTestRunner.java:1041)

24-May-2018 21:45:13.133 INFO [main] org.apache.coyote.AbstractProtocol.start Starting ProtocolHandler ["http-nio2-127.0.0.1-auto-18-32902"]
24-May-2018 21:45:13.133 INFO [main] org.apache.coyote.AbstractProtocol.pause Pausing ProtocolHandler ["http-nio2-127.0.0.1-auto-18-32902"]
24-May-2018 21:45:13.184 INFO [main] org.apache.catalina.core.StandardService.stopInternal Stopping service [Tomcat]
24-May-2018 21:45:13.188 INFO [main] org.apache.coyote.AbstractProtocol.stop Stopping ProtocolHandler ["http-nio2-127.0.0.1-auto-18-32902"]
24-May-2018 21:45:13.189 INFO [main] org.apache.catalina.core.StandardService.startInternal Starting service [Tomcat]
24-May-2018 21:45:13.189 INFO [main] org.apache.catalina.core.StandardEngine.startInternal Starting Servlet Engine: Apache Tomcat/9.0.9-dev
24-May-2018 21:45:13.193 SEVERE [main] org.apache.catalina.core.StandardContext.loadOnStartup Servlet [myservlet] in web application [] threw load() exception
 javax.servlet.ServletException: failing on purpose
	at org.apache.catalina.core.TestStandardContext$FailingStartupServlet.init(TestStandardContext.java:908)
	at javax.servlet.GenericServlet.init(GenericServlet.java:158)
	at org.apache.catalina.startup.Tomcat$ExistingStandardWrapper.loadServlet(Tomcat.java:1042)
	at org.apache.catalina.core.StandardWrapper.load(StandardWrapper.java:971)
	at org.apache.catalina.core.StandardContext.loadOnStartup(StandardContext.java:4829)
	at org.apache.catalina.core.StandardContext.startInternal(StandardContext.java:5143)
	at org.apache.catalina.util.LifecycleBase.start(LifecycleBase.java:183)
	at org.apache.catalina.core.ContainerBase$StartChild.call(ContainerBase.java:1427)
	at org.apache.catalina.core.ContainerBase$StartChild.call(ContainerBase.java:1417)
	at java.util.concurrent.FutureTask.run(FutureTask.java:266)
	at org.apache.tomcat.util.threads.InlineExecutorService.execute(InlineExecutorService.java:75)
	at java.util.concurrent.AbstractExecutorService.submit(AbstractExecutorService.java:134)
	at org.apache.catalina.core.ContainerBase.startInternal(ContainerBase.java:943)
	at org.apache.catalina.core.StandardHost.startInternal(StandardHost.java:839)
	at org.apache.catalina.util.LifecycleBase.start(LifecycleBase.java:183)
	at org.apache.catalina.core.ContainerBase$StartChild.call(ContainerBase.java:1427)
	at org.apache.catalina.core.ContainerBase$StartChild.call(ContainerBase.java:1417)
	at java.util.concurrent.FutureTask.run(FutureTask.java:266)
	at org.apache.tomcat.util.threads.InlineExecutorService.execute(InlineExecutorService.java:75)
	at java.util.concurrent.AbstractExecutorService.submit(AbstractExecutorService.java:134)
	at org.apache.catalina.core.ContainerBase.startInternal(ContainerBase.java:943)
	at org.apache.catalina.core.StandardEngine.startInternal(StandardEngine.java:258)
	at org.apache.catalina.util.LifecycleBase.start(LifecycleBase.java:183)
	at org.apache.catalina.core.StandardService.startInternal(StandardService.java:422)
	at org.apache.catalina.util.LifecycleBase.start(LifecycleBase.java:183)
	at org.apache.catalina.core.StandardServer.startInternal(StandardServer.java:770)
	at org.apache.catalina.util.LifecycleBase.start(LifecycleBase.java:183)
	at org.apache.catalina.startup.Tomcat.start(Tomcat.java:371)
	at org.apache.catalina.startup.TomcatBaseTest$TomcatWithFastSessionIDs.start(TomcatBaseTest.java:845)
	at org.apache.catalina.core.TestStandardContext.testFlagFailCtxIfServletStartFails(TestStandardContext.java:897)
	at sun.reflect.NativeMethodAccessorImpl.invoke0(Native Method)
	at sun.reflect.NativeMethodAccessorImpl.invoke(NativeMethodAccessorImpl.java:62)
	at sun.reflect.DelegatingMethodAccessorImpl.invoke(DelegatingMethodAccessorImpl.java:43)
	at java.lang.reflect.Method.invoke(Method.java:498)
	at org.junit.runners.model.FrameworkMethod$1.runReflectiveCall(FrameworkMethod.java:59)
	at org.junit.internal.runners.model.ReflectiveCallable.run(ReflectiveCallable.java:12)
	at org.junit.runners.model.FrameworkMethod.invokeExplosively(FrameworkMethod.java:61)
	at org.junit.internal.runners.statements.InvokeMethod.evaluate(InvokeMethod.java:17)
	at org.junit.internal.runners.statements.RunBefores.evaluate(RunBefores.java:26)
	at org.junit.internal.runners.statements.RunAfters.evaluate(RunAfters.java:27)
	at org.junit.rules.TestWatcher$1.evaluate(TestWatcher.java:61)
	at org.junit.runners.BlockJUnit4ClassRunner$1.evaluate(BlockJUnit4ClassRunner.java:100)
	at org.junit.runners.ParentRunner.runLeaf(ParentRunner.java:346)
	at org.junit.runners.BlockJUnit4ClassRunner.runChild(BlockJUnit4ClassRunner.java:103)

Continuation...

	at org.junit.runners.BlockJUnit4ClassRunner.runChild(BlockJUnit4ClassRunner.java:63)
	at org.junit.runners.ParentRunner$3.run(ParentRunner.java:311)
	at org.junit.runners.ParentRunner$1.schedule(ParentRunner.java:76)
	at org.junit.runners.ParentRunner.runChildren(ParentRunner.java:309)
	at org.junit.runners.ParentRunner.access$100(ParentRunner.java:63)
	at org.junit.runners.ParentRunner$2.evaluate(ParentRunner.java:289)
	at org.junit.internal.runners.statements.RunBefores.evaluate(RunBefores.java:26)
	at org.junit.internal.runners.statements.RunAfters.evaluate(RunAfters.java:27)
	at org.junit.runners.ParentRunner.run(ParentRunner.java:393)
	at junit.framework.JUnit4TestAdapter.run(JUnit4TestAdapter.java:48)
	at org.apache.tools.ant.taskdefs.optional.junit.JUnitTestRunner.run(JUnitTestRunner.java:534)
	at org.apache.tools.ant.taskdefs.optional.junit.JUnitTestRunner.launch(JUnitTestRunner.java:1196)
	at org.apache.tools.ant.taskdefs.optional.junit.JUnitTestRunner.main(JUnitTestRunner.java:1041)

24-May-2018 21:45:13.198 SEVERE [main] org.apache.catalina.core.StandardContext.startInternal One or more Servlets failed to load on startup. Full details will be found in the appropriate container log file
24-May-2018 21:45:13.198 SEVERE [main] org.apache.catalina.core.StandardContext.startInternal Context [] startup failed due to previous errors
24-May-2018 21:45:13.201 INFO [main] org.apache.coyote.AbstractProtocol.start Starting ProtocolHandler ["http-nio2-127.0.0.1-auto-18-32902"]
24-May-2018 21:45:13.201 INFO [main] org.apache.coyote.AbstractProtocol.pause Pausing ProtocolHandler ["http-nio2-127.0.0.1-auto-18-32902"]
24-May-2018 21:45:13.252 INFO [main] org.apache.catalina.core.StandardService.stopInternal Stopping service [Tomcat]
24-May-2018 21:45:13.253 INFO [main] org.apache.coyote.AbstractProtocol.stop Stopping ProtocolHandler ["http-nio2-127.0.0.1-auto-18-32902"]
24-May-2018 21:45:13.253 INFO [main] org.apache.coyote.AbstractProtocol.destroy Destroying ProtocolHandler ["http-nio2-127.0.0.1-auto-18-32902"]
24-May-2018 21:45:13.255 INFO [main] org.apache.catalina.startup.LoggingBaseTest.setUp Starting test case [testAddPreDestroyMethodNullClassName]
24-May-2018 21:45:13.256 INFO [main] org.apache.coyote.AbstractProtocol.destroy Destroying ProtocolHandler ["http-nio2-127.0.0.1-auto-19"]
24-May-2018 21:45:13.257 INFO [main] org.apache.catalina.startup.LoggingBaseTest.setUp Starting test case [testAddPreDestroyMethodNullMethodName]
24-May-2018 21:45:13.257 INFO [main] org.apache.coyote.AbstractProtocol.destroy Destroying ProtocolHandler ["http-nio2-127.0.0.1-auto-20"]
24-May-2018 21:45:13.258 INFO [main] org.apache.catalina.startup.LoggingBaseTest.setUp Starting test case [testAddPostConstructMethodNullMethodName]
24-May-2018 21:45:13.258 INFO [main] org.apache.coyote.AbstractProtocol.destroy Destroying ProtocolHandler ["http-nio2-127.0.0.1-auto-21"]
24-May-2018 21:45:13.259 INFO [main] org.apache.catalina.startup.LoggingBaseTest.setUp Starting test case [testSetPath]
24-May-2018 21:45:13.259 WARNING [main] org.apache.catalina.core.StandardContext.setPath A context path must either be an empty string or start with a '/' and do not end with a '/'. The path [null] does not meet these criteria and has been changed to []
24-May-2018 21:45:13.260 WARNING [main] org.apache.catalina.core.StandardContext.setPath A context path must either be an empty string or start with a '/' and do not end with a '/'. The path [/] does not meet these criteria and has been changed to []
24-May-2018 21:45:13.260 WARNING [main] org.apache.catalina.core.StandardContext.setPath A context path must either be an empty string or start with a '/' and do not end with a '/'. The path [foo] does not meet these criteria and has been changed to [/foo]
24-May-2018 21:45:13.260 WARNING [main] org.apache.catalina.core.StandardContext.setPath A context path must either be an empty string or start with a '/' and do not end with a '/'. The path [/foo/bar/] does not meet these criteria and has been changed to [/foo/bar]
24-May-2018 21:45:13.260 WARNING [main] org.apache.catalina.core.StandardContext.setPath A context path must either be an empty string or start with a '/' and do not end with a '/'. The path [foo/bar/] does not meet these criteria and has been changed to [/foo/bar]
24-May-2018 21:45:13.260 INFO [main] org.apache.coyote.AbstractProtocol.destroy Destroying ProtocolHandler ["http-nio2-127.0.0.1-auto-22"]
24-May-2018 21:45:13.261 INFO [main] org.apache.catalina.startup.LoggingBaseTest.setUp Starting test case [testAddPostConstructMethodConflicts]
24-May-2018 21:45:13.261 INFO [main] org.apache.coyote.AbstractProtocol.destroy Destroying ProtocolHandler ["http-nio2-127.0.0.1-auto-23"]
24-May-2018 21:45:13.262 INFO [main] org.apache.catalina.startup.LoggingBaseTest.setUp Starting test case [testDenyUncoveredHttpMethodsSCIFalse]
24-May-2018 21:45:13.264 INFO [main] org.apache.coyote.AbstractProtocol.init Initializing ProtocolHandler ["http-nio2-127.0.0.1-auto-24"]
24-May-2018 21:45:13.270 INFO [main] org.apache.catalina.core.StandardService.startInternal Starting service [Tomcat]
24-May-2018 21:45:13.270 INFO [main] org.apache.catalina.core.StandardEngine.startInternal Starting Servlet Engine: Apache Tomcat/9.0.9-dev
24-May-2018 21:45:13.273 SEVERE [main] org.apache.tomcat.util.descriptor.web.SecurityConstraint.findUncoveredHttpMethods For security constraints with URL pattern [/test] only the HTTP methods [POST] are covered. All other methods are uncovered.
24-May-2018 21:45:13.275 INFO [main] org.apache.coyote.AbstractProtocol.start Starting ProtocolHandler ["http-nio2-127.0.0.1-auto-24-51843"]
24-May-2018 21:45:13.285 INFO [main] org.apache.coyote.AbstractProtocol.pause Pausing ProtocolHandler ["http-nio2-127.0.0.1-auto-24-51843"]
24-May-2018 21:45:13.336 INFO [main] org.apache.catalina.core.StandardService.stopInternal Stopping service [Tomcat]
24-May-2018 21:45:13.338 INFO [main] org.apache.coyote.AbstractProtocol.stop Stopping ProtocolHandler ["http-nio2-127.0.0.1-auto-24-51843"]
24-May-2018 21:45:13.338 INFO [main] org.apache.coyote.AbstractProtocol.destroy Destroying ProtocolHandler ["http-nio2-127.0.0.1-auto-24-51843"]
------------- ---------------- ---------------

Testcase: testTldListener took 0.917 sec
Testcase: testWebappListenerConfigureFail took 1.752 sec
Testcase: testDenyUncoveredHttpMethodsSCITrue took 0.098 sec
Testcase: testAddPostConstructMethodNullClassName took 0.006 sec
Testcase: testAddPreDestroyMethodConflicts took 0.004 sec
Testcase: testBug46243 took 0.067 sec
Testcase: testBug49711 took 0.136 sec
Testcase: testBug49922 took 0.423 sec
Testcase: testBug50015 took 0.072 sec
Testcase: testBug56085 took 0.175 sec
Testcase: testBug56903 took 0.006 sec
Testcase: testWebappLoaderStartFail took 0.335 sec
Testcase: testUncoveredMethods took 0.083 sec
Testcase: testBug51376a took 0.129 sec
Testcase: testBug51376b took 0.084 sec
Testcase: testBug57556a took 0.349 sec
Testcase: testBug57556b took 0.08 sec
Testcase: testFlagFailCtxIfServletStartFails took 0.141 sec
Testcase: testAddPreDestroyMethodNullClassName took 0.001 sec
Testcase: testAddPreDestroyMethodNullMethodName took 0.001 sec
Testcase: testAddPostConstructMethodNullMethodName took 0.001 sec
Testcase: testSetPath took 0.001 sec
Testcase: testAddPostConstructMethodConflicts took 0.001 sec
Testcase: testDenyUncoveredHttpMethodsSCIFalse took 0.082 sec

Apache Gump, Gump, Apache, the Apache feather logo, and the Apache Gump project logos are trademarks of The Apache Software Foundation.

Last Updated: Thu, 24 May 2018 18:00:05 ().Python Logo