Run| Workspace| Log| Issues| Fixes| Pre-reqs| Stats| XRef| Maven Repository Proxy Log Gump Logo

Details

Parameters

Prefix Name Value
--batch-mode
-D skipTests true
-D javaVersion 1.8
--settings
/srv/gump/public/workspace/rat/gump_mvn_settings.xml
package

Environment Overrides

Name Value
M2_HOME /opt/maven3

Command Line

/opt/maven3/bin/mvn --batch-mode -DskipTests=true -DjavaVersion=1.8 --settings
        /srv/gump/public/workspace/rat/gump_mvn_settings.xml package 

Output

[INFO] Scanning for projects...
[INFO] Downloading: http://localhost:8192/maven2/org/apache/maven/wagon/wagon-ssh/1.0-beta-7/wagon-ssh-1.0-beta-7.pom
[INFO] Downloaded: http://localhost:8192/maven2/org/apache/maven/wagon/wagon-ssh/1.0-beta-7/wagon-ssh-1.0-beta-7.pom (3 KB at 36.0 KB/sec)
[INFO] Downloading: http://localhost:8192/maven2/org/apache/maven/wagon/wagon-providers/1.0-beta-7/wagon-providers-1.0-beta-7.pom
[INFO] Downloaded: http://localhost:8192/maven2/org/apache/maven/wagon/wagon-providers/1.0-beta-7/wagon-providers-1.0-beta-7.pom (3 KB at 132.4 KB/sec)
[INFO] Downloading: http://localhost:8192/maven2/org/apache/maven/wagon/wagon/1.0-beta-7/wagon-1.0-beta-7.pom
[INFO] Downloaded: http://localhost:8192/maven2/org/apache/maven/wagon/wagon/1.0-beta-7/wagon-1.0-beta-7.pom (12 KB at 603.9 KB/sec)
[INFO] Downloading: http://localhost:8192/maven2/com/jcraft/jsch/0.1.38/jsch-0.1.38.pom
[INFO] Downloaded: http://localhost:8192/maven2/com/jcraft/jsch/0.1.38/jsch-0.1.38.pom (967 B at 49.7 KB/sec)
[INFO] Downloading: http://localhost:8192/maven2/org/apache/maven/wagon/wagon-ssh-common/1.0-beta-7/wagon-ssh-common-1.0-beta-7.pom
[INFO] Downloaded: http://localhost:8192/maven2/org/apache/maven/wagon/wagon-ssh-common/1.0-beta-7/wagon-ssh-common-1.0-beta-7.pom (2 KB at 101.5 KB/sec)
[INFO] Downloading: http://localhost:8192/maven2/org/apache/maven/wagon/wagon-provider-api/1.0-beta-7/wagon-provider-api-1.0-beta-7.pom
[INFO] Downloaded: http://localhost:8192/maven2/org/apache/maven/wagon/wagon-provider-api/1.0-beta-7/wagon-provider-api-1.0-beta-7.pom (2 KB at 126.0 KB/sec)
[INFO] Downloading: http://localhost:8192/maven2/org/apache/maven/wagon/wagon-ssh/1.0-beta-7/wagon-ssh-1.0-beta-7.jar
[INFO] Downloading: http://localhost:8192/maven2/com/jcraft/jsch/0.1.38/jsch-0.1.38.jar
[INFO] Downloading: http://localhost:8192/maven2/org/apache/maven/wagon/wagon-ssh-common/1.0-beta-7/wagon-ssh-common-1.0-beta-7.jar
[INFO] Downloading: http://localhost:8192/maven2/org/apache/maven/wagon/wagon-provider-api/1.0-beta-7/wagon-provider-api-1.0-beta-7.jar
[INFO] Downloaded: http://localhost:8192/maven2/org/apache/maven/wagon/wagon-ssh-common/1.0-beta-7/wagon-ssh-common-1.0-beta-7.jar (27 KB at 1181.9 KB/sec)
[INFO] Downloaded: http://localhost:8192/maven2/org/apache/maven/wagon/wagon-ssh/1.0-beta-7/wagon-ssh-1.0-beta-7.jar (28 KB at 955.0 KB/sec)
[INFO] Downloaded: http://localhost:8192/maven2/com/jcraft/jsch/0.1.38/jsch-0.1.38.jar (174 KB at 5424.4 KB/sec)
[INFO] Downloaded: http://localhost:8192/maven2/org/apache/maven/wagon/wagon-provider-api/1.0-beta-7/wagon-provider-api-1.0-beta-7.jar (52 KB at 1404.9 KB/sec)
[INFO] ------------------------------------------------------------------------
[INFO] Reactor Build Order:
[INFO] 
[INFO] Apache Creadur Rat
[INFO] Apache Creadur Rat::API
[INFO] Apache Creadur Rat::Core
[INFO] Apache Creadur Rat::Plugin4Maven
[INFO] Apache Creadur Rat::Tasks4Ant
[INFO] Apache Creadur Rat::Command Line
[INFO]                                                                         
[INFO] ------------------------------------------------------------------------
[INFO] Building Apache Creadur Rat 0.13-SNAPSHOT
[INFO] ------------------------------------------------------------------------
[INFO] Downloading: http://localhost:8192/maven2/org/apache/rat/apache-rat-plugin/0.12/apache-rat-plugin-0.12.pom
[INFO] Downloaded: http://localhost:8192/maven2/org/apache/rat/apache-rat-plugin/0.12/apache-rat-plugin-0.12.pom (10 KB at 657.5 KB/sec)
[INFO] Downloading: http://localhost:8192/maven2/org/apache/rat/apache-rat-project/0.12/apache-rat-project-0.12.pom
[INFO] Downloaded: http://localhost:8192/maven2/org/apache/rat/apache-rat-project/0.12/apache-rat-project-0.12.pom (24 KB at 1585.5 KB/sec)
[INFO] Downloading: http://localhost:8192/maven2/org/apache/rat/apache-rat-plugin/0.12/apache-rat-plugin-0.12.jar
[INFO] Downloaded: http://localhost:8192/maven2/org/apache/rat/apache-rat-plugin/0.12/apache-rat-plugin-0.12.jar (46 KB at 2555.5 KB/sec)
[INFO] Downloading: http://localhost:8192/maven2/org/codehaus/mojo/animal-sniffer-maven-plugin/1.11/animal-sniffer-maven-plugin-1.11.pom
[INFO] Downloaded: http://localhost:8192/maven2/org/codehaus/mojo/animal-sniffer-maven-plugin/1.11/animal-sniffer-maven-plugin-1.11.pom (5 KB at 216.1 KB/sec)
[INFO] Downloading: http://localhost:8192/maven2/org/codehaus/mojo/animal-sniffer-parent/1.11/animal-sniffer-parent-1.11.pom
[INFO] Downloaded: http://localhost:8192/maven2/org/codehaus/mojo/animal-sniffer-parent/1.11/animal-sniffer-parent-1.11.pom (5 KB at 178.6 KB/sec)
[INFO] Downloading: http://localhost:8192/maven2/org/codehaus/mojo/animal-sniffer-maven-plugin/1.11/animal-sniffer-maven-plugin-1.11.jar
[INFO] Downloaded: http://localhost:8192/maven2/org/codehaus/mojo/animal-sniffer-maven-plugin/1.11/animal-sniffer-maven-plugin-1.11.jar (29 KB at 430.7 KB/sec)
[INFO] 
[INFO] --- maven-enforcer-plugin:1.4.1:enforce (enforce-bytecode-version) @ apache-rat-project ---
[INFO] Downloading: http://localhost:8192/maven2/org/codehaus/mojo/extra-enforcer-rules/1.0-beta-5/extra-enforcer-rules-1.0-beta-5.pom
[INFO] Downloaded: http://localhost:8192/maven2/org/codehaus/mojo/extra-enforcer-rules/1.0-beta-5/extra-enforcer-rules-1.0-beta-5.pom (8 KB at 430.3 KB/sec)
[INFO] Downloading: http://localhost:8192/maven2/com/ibm/icu/icu4j/56.1/icu4j-56.1.pom
[INFO] Downloaded: http://localhost:8192/maven2/com/ibm/icu/icu4j/56.1/icu4j-56.1.pom (5 KB at 235.5 KB/sec)
[INFO] Downloading: http://localhost:8192/maven2/org/codehaus/mojo/extra-enforcer-rules/1.0-beta-5/extra-enforcer-rules-1.0-beta-5.jar
[INFO] Downloading: http://localhost:8192/maven2/com/ibm/icu/icu4j/56.1/icu4j-56.1.jar
[INFO] Downloaded: http://localhost:8192/maven2/org/codehaus/mojo/extra-enforcer-rules/1.0-beta-5/extra-enforcer-rules-1.0-beta-5.jar (36 KB at 1857.9 KB/sec)
[INFO] Downloaded: http://localhost:8192/maven2/com/ibm/icu/icu4j/56.1/icu4j-56.1.jar (10731 KB at 65035.3 KB/sec)
[INFO] 
[INFO] --- apache-rat-plugin:0.12:check (default) @ apache-rat-project ---
[INFO] Downloading: http://localhost:8192/maven2/org/apache/rat/apache-rat-core/0.12/apache-rat-core-0.12.pom
[INFO] Downloaded: http://localhost:8192/maven2/org/apache/rat/apache-rat-core/0.12/apache-rat-core-0.12.pom (5 KB at 244.1 KB/sec)
[INFO] Downloading: http://localhost:8192/maven2/org/apache/rat/apache-rat-api/0.12/apache-rat-api-0.12.pom
[INFO] Downloaded: http://localhost:8192/maven2/org/apache/rat/apache-rat-api/0.12/apache-rat-api-0.12.pom (2 KB at 121.7 KB/sec)
[INFO] Downloading: http://localhost:8192/maven2/org/apache/maven/doxia/doxia-logging-api/1.2/doxia-logging-api-1.2.jar
[INFO] Downloading: http://localhost:8192/maven2/org/codehaus/plexus/plexus-classworlds/1.2-alpha-9/plexus-classworlds-1.2-alpha-9.jar
[INFO] Downloading: http://localhost:8192/maven2/org/apache/rat/apache-rat-api/0.12/apache-rat-api-0.12.jar
[INFO] Downloading: http://localhost:8192/maven2/org/apache/rat/apache-rat-core/0.12/apache-rat-core-0.12.jar
[INFO] Downloaded: http://localhost:8192/maven2/org/apache/maven/doxia/doxia-logging-api/1.2/doxia-logging-api-1.2.jar (12 KB at 527.7 KB/sec)
[INFO] Downloaded: http://localhost:8192/maven2/org/codehaus/plexus/plexus-classworlds/1.2-alpha-9/plexus-classworlds-1.2-alpha-9.jar (42 KB at 1730.4 KB/sec)
[INFO] Downloaded: http://localhost:8192/maven2/org/apache/rat/apache-rat-api/0.12/apache-rat-api-0.12.jar (11 KB at 414.3 KB/sec)
[INFO] Downloaded: http://localhost:8192/maven2/org/apache/rat/apache-rat-core/0.12/apache-rat-core-0.12.jar (120 KB at 3144.6 KB/sec)
[INFO] Enabled default license matchers.
[INFO] Will parse SCM ignores for exclusions...
[INFO] Parsing exclusions from /srv/gump/public/workspace/rat/.gitignore
[INFO] Finished adding exclusions from SCM ignore files.
[INFO] 78 implicit excludes (use -debug for more details).
[INFO] Exclude: .travis.yml
[INFO] Exclude: BUILD.txt
[INFO] Exclude: apache-rat/README*.txt
[INFO] Exclude: apache-rat-core/src/test/resources/**
[INFO] Exclude: apache-rat*/target/**
[INFO] Exclude: apache-rat-plugin/src/test/resources/**
[INFO] Exclude: apache-rat-plugin/src/it/**
[INFO] Exclude: apache-rat-tasks/src/test/resources/**
[INFO] Exclude: **/iso-8859-1.html
[INFO] 18 resources included (use -debug for more details)
[INFO] Rat check: Summary over all files. Unapproved: 0, unknown: 0, generated: 0, approved: 13 licenses.
[INFO] 
[INFO] --- maven-remote-resources-plugin:1.5:process (process-resource-bundles) @ apache-rat-project ---
[INFO] 
[INFO] --- animal-sniffer-maven-plugin:1.11:check (check-java-1.5-compat) @ apache-rat-project ---
[INFO] Downloading: http://localhost:8192/maven2/org/codehaus/mojo/animal-sniffer/1.11/animal-sniffer-1.11.pom
[INFO] Downloaded: http://localhost:8192/maven2/org/codehaus/mojo/animal-sniffer/1.11/animal-sniffer-1.11.pom (3 KB at 108.0 KB/sec)
[INFO] Downloading: http://localhost:8192/maven2/org/ow2/asm/asm-all/4.0/asm-all-4.0.pom
[INFO] Downloaded: http://localhost:8192/maven2/org/ow2/asm/asm-all/4.0/asm-all-4.0.pom (2 KB at 76.9 KB/sec)
[INFO] Downloading: http://localhost:8192/maven2/org/ow2/asm/asm-parent/4.0/asm-parent-4.0.pom
[INFO] Downloaded: http://localhost:8192/maven2/org/ow2/asm/asm-parent/4.0/asm-parent-4.0.pom (6 KB at 315.5 KB/sec)
[INFO] Downloading: http://localhost:8192/maven2/org/codehaus/mojo/java-boot-classpath-detector/1.11/java-boot-classpath-detector-1.11.pom
[INFO] Downloaded: http://localhost:8192/maven2/org/codehaus/mojo/java-boot-classpath-detector/1.11/java-boot-classpath-detector-1.11.pom (3 KB at 99.2 KB/sec)
[INFO] Downloading: http://localhost:8192/maven2/org/codehaus/mojo/animal-sniffer/1.11/animal-sniffer-1.11.jar
[INFO] Downloading: http://localhost:8192/maven2/org/codehaus/mojo/java-boot-classpath-detector/1.11/java-boot-classpath-detector-1.11.jar
[INFO] Downloaded: http://localhost:8192/maven2/org/codehaus/mojo/animal-sniffer/1.11/animal-sniffer-1.11.jar (32 KB at 1214.6 KB/sec)
[INFO] Downloaded: http://localhost:8192/maven2/org/codehaus/mojo/java-boot-classpath-detector/1.11/java-boot-classpath-detector-1.11.jar (5 KB at 184.5 KB/sec)
[INFO] Checking unresolved references to org.codehaus.mojo.signature:java15:1.0
[INFO] 
[INFO] --- maven-site-plugin:3.4:attach-descriptor (attach-descriptor) @ apache-rat-project ---
[INFO] Downloading: http://localhost:8192/maven2/org/codehaus/plexus/plexus-archiver/2.4.3/plexus-archiver-2.4.3.pom
[INFO] Downloaded: http://localhost:8192/maven2/org/codehaus/plexus/plexus-archiver/2.4.3/plexus-archiver-2.4.3.pom (4 KB at 202.7 KB/sec)
[INFO] Downloading: http://localhost:8192/maven2/org/codehaus/plexus/plexus-utils/3.0.11/plexus-utils-3.0.11.pom
[INFO] Downloaded: http://localhost:8192/maven2/org/codehaus/plexus/plexus-utils/3.0.11/plexus-utils-3.0.11.pom (4 KB at 219.4 KB/sec)
[INFO] Downloading: http://localhost:8192/maven2/org/codehaus/plexus/plexus-io/2.0.8/plexus-io-2.0.8.pom
[INFO] Downloaded: http://localhost:8192/maven2/org/codehaus/plexus/plexus-io/2.0.8/plexus-io-2.0.8.pom (3 KB at 127.1 KB/sec)
[INFO] Downloading: http://localhost:8192/maven2/org/codehaus/plexus/plexus-archiver/2.4.3/plexus-archiver-2.4.3.jar
[INFO] Downloading: http://localhost:8192/maven2/org/codehaus/plexus/plexus-io/2.0.8/plexus-io-2.0.8.jar
[INFO] Downloaded: http://localhost:8192/maven2/org/codehaus/plexus/plexus-archiver/2.4.3/plexus-archiver-2.4.3.jar (160 KB at 6395.2 KB/sec)
[INFO] Downloaded: http://localhost:8192/maven2/org/codehaus/plexus/plexus-io/2.0.8/plexus-io-2.0.8.jar (58 KB at 1916.8 KB/sec)
[INFO]                                                                         
[INFO] ------------------------------------------------------------------------
[INFO] Building Apache Creadur Rat::API 0.13-SNAPSHOT
[INFO] ------------------------------------------------------------------------
[INFO] 
[INFO] --- maven-enforcer-plugin:1.4.1:enforce (enforce-bytecode-version) @ apache-rat-api ---
[INFO] 
[INFO] --- apache-rat-plugin:0.12:check (default) @ apache-rat-api ---
[INFO] Enabled default license matchers.
[INFO] Will parse SCM ignores for exclusions...
[INFO] Parsing exclusions from /srv/gump/public/workspace/rat/apache-rat-api/.gitignore
[INFO] Finished adding exclusions from SCM ignore files.
[INFO] 74 implicit excludes (use -debug for more details).
[INFO] Exclude: .travis.yml
[INFO] Exclude: BUILD.txt
[INFO] Exclude: apache-rat/README*.txt
[INFO] Exclude: apache-rat-core/src/test/resources/**
[INFO] Exclude: apache-rat*/target/**
[INFO] Exclude: apache-rat-plugin/src/test/resources/**
[INFO] Exclude: apache-rat-plugin/src/it/**
[INFO] Exclude: apache-rat-tasks/src/test/resources/**
[INFO] Exclude: **/iso-8859-1.html
[INFO] 8 resources included (use -debug for more details)
[INFO] Rat check: Summary over all files. Unapproved: 0, unknown: 0, generated: 0, approved: 8 licenses.
[INFO] 
[INFO] --- maven-remote-resources-plugin:1.5:process (process-resource-bundles) @ apache-rat-api ---
[INFO] 
[INFO] --- maven-resources-plugin:2.7:resources (default-resources) @ apache-rat-api ---
[INFO] Using 'UTF-8' encoding to copy filtered resources.
[INFO] skip non existing resourceDirectory /srv/gump/public/workspace/rat/apache-rat-api/src/main/resources
[INFO] Copying 3 resources
[INFO] 
[INFO] --- maven-compiler-plugin:3.7.0:compile (default-compile) @ apache-rat-api ---
[INFO] Changes detected - recompiling the module!
[INFO] Compiling 3 source files to /srv/gump/public/workspace/rat/apache-rat-api/target/classes
[INFO] 
[INFO] --- animal-sniffer-maven-plugin:1.11:check (check-java-1.5-compat) @ apache-rat-api ---
[INFO] Checking unresolved references to org.codehaus.mojo.signature:java15:1.0
[INFO] 
[INFO] --- maven-resources-plugin:2.7:testResources (default-testResources) @ apache-rat-api ---
[INFO] Using 'UTF-8' encoding to copy filtered resources.
[INFO] skip non existing resourceDirectory /srv/gump/public/workspace/rat/apache-rat-api/src/test/resources
[INFO] Copying 3 resources
[INFO] 
[INFO] --- maven-compiler-plugin:3.7.0:testCompile (default-testCompile) @ apache-rat-api ---
[INFO] Changes detected - recompiling the module!
[INFO] Compiling 2 source files to /srv/gump/public/workspace/rat/apache-rat-api/target/test-classes
[INFO] /srv/gump/public/workspace/rat/apache-rat-api/src/test/java/org/apache/rat/api/domain/LicenseFamilyBuilderTest.java: Some input files use or override a deprecated API.
[INFO] /srv/gump/public/workspace/rat/apache-rat-api/src/test/java/org/apache/rat/api/domain/LicenseFamilyBuilderTest.java: Recompile with -Xlint:deprecation for details.
[INFO] 
[INFO] --- maven-surefire-plugin:2.19.1:test (default-test) @ apache-rat-api ---
[INFO] Tests are skipped.
[INFO] 
[INFO] --- maven-jar-plugin:3.0.0:jar (default-jar) @ apache-rat-api ---
[INFO] Building jar: /srv/gump/public/workspace/rat/apache-rat-api/target/apache-rat-api-0.13-SNAPSHOT.jar
[INFO] 
[INFO] --- maven-site-plugin:3.4:attach-descriptor (attach-descriptor) @ apache-rat-api ---
[INFO]                                                                         
[INFO] ------------------------------------------------------------------------
[INFO] Building Apache Creadur Rat::Core 0.13-SNAPSHOT
[INFO] ------------------------------------------------------------------------
[INFO] Downloading: http://localhost:8192/maven2/commons-cli/commons-cli/1.3.1/commons-cli-1.3.1.pom
[INFO] Downloaded: http://localhost:8192/maven2/commons-cli/commons-cli/1.3.1/commons-cli-1.3.1.pom (11 KB at 676.6 KB/sec)
[INFO] Downloading: http://localhost:8192/maven2/commons-cli/commons-cli/1.3.1/commons-cli-1.3.1.jar
[INFO] Downloaded: http://localhost:8192/maven2/commons-cli/commons-cli/1.3.1/commons-cli-1.3.1.jar (54 KB at 3565.6 KB/sec)
[INFO] 
[INFO] --- maven-enforcer-plugin:1.4.1:enforce (enforce-bytecode-version) @ apache-rat-core ---
[INFO] 
[INFO] --- apache-rat-plugin:0.12:check (default) @ apache-rat-core ---
[INFO] Enabled default license matchers.
[INFO] Will parse SCM ignores for exclusions...
[INFO] Finished adding exclusions from SCM ignore files.
[INFO] 61 implicit excludes (use -debug for more details).
[INFO] Exclude: src/test/resources/appliedAL20/bad/*.*
[INFO] Exclude: src/test/resources/oasis/bad/*.*
[INFO] Exclude: src/test/resources/elements/Source.java
[INFO] Exclude: src/test/resources/elements/ILoggerFactory.java
[INFO] Exclude: src/test/resources/elements/sub/Empty.txt
[INFO] Exclude: src/test/resources/violations/bad.txt
[INFO] Exclude: src/test/resources/violations/FilterTest.cs
[INFO] Exclude: src/test/resources/binaries/Image-png.not
[INFO] 166 resources included (use -debug for more details)
[INFO] Rat check: Summary over all files. Unapproved: 0, unknown: 0, generated: 0, approved: 158 licenses.
[INFO] 
[INFO] --- maven-remote-resources-plugin:1.5:process (process-resource-bundles) @ apache-rat-core ---
[INFO] 
[INFO] --- maven-resources-plugin:2.7:resources (default-resources) @ apache-rat-core ---
[INFO] Using 'UTF-8' encoding to copy filtered resources.
[INFO] Copying 2 resources
[INFO] skip non existing resourceDirectory /srv/gump/public/workspace/rat/apache-rat-core/src/main/filtered-resources
[INFO] Copying 1 resource to META-INF
[INFO] Copying 3 resources
[INFO] 
[INFO] --- maven-compiler-plugin:3.7.0:compile (default-compile) @ apache-rat-core ---
[INFO] Changes detected - recompiling the module!
[INFO] Compiling 94 source files to /srv/gump/public/workspace/rat/apache-rat-core/target/classes
[INFO] /srv/gump/public/workspace/rat/apache-rat-core/src/main/java/org/apache/rat/annotation/AbstractLicenseAppender.java: Some input files use or override a deprecated API.
[INFO] /srv/gump/public/workspace/rat/apache-rat-core/src/main/java/org/apache/rat/annotation/AbstractLicenseAppender.java: Recompile with -Xlint:deprecation for details.
[INFO] 
[INFO] --- animal-sniffer-maven-plugin:1.11:check (check-java-1.5-compat) @ apache-rat-core ---
[INFO] Checking unresolved references to org.codehaus.mojo.signature:java15:1.0
[INFO] 
[INFO] --- maven-resources-plugin:2.7:testResources (default-testResources) @ apache-rat-core ---
[INFO] Using 'UTF-8' encoding to copy filtered resources.
[INFO] Copying 25 resources
[INFO] Copying 3 resources
[INFO] 
[INFO] --- maven-compiler-plugin:3.7.0:testCompile (default-testCompile) @ apache-rat-core ---
[INFO] Changes detected - recompiling the module!
[INFO] Compiling 49 source files to /srv/gump/public/workspace/rat/apache-rat-core/target/test-classes
[INFO] /srv/gump/public/workspace/rat/apache-rat-core/src/test/java/org/apache/rat/document/impl/guesser/BinaryGuesserTest.java: Some input files use or override a deprecated API.
[INFO] /srv/gump/public/workspace/rat/apache-rat-core/src/test/java/org/apache/rat/document/impl/guesser/BinaryGuesserTest.java: Recompile with -Xlint:deprecation for details.
[INFO] 
[INFO] --- maven-surefire-plugin:2.19.1:test (default-test) @ apache-rat-core ---
[INFO] Tests are skipped.
[INFO] 
[INFO] --- maven-jar-plugin:3.0.0:jar (default-jar) @ apache-rat-core ---
[INFO] Building jar: /srv/gump/public/workspace/rat/apache-rat-core/target/apache-rat-core-0.13-SNAPSHOT.jar
[INFO] 
[INFO] --- maven-site-plugin:3.4:attach-descriptor (attach-descriptor) @ apache-rat-core ---
[INFO]                                                                         
[INFO] ------------------------------------------------------------------------
[INFO] Building Apache Creadur Rat::Plugin4Maven 0.13-SNAPSHOT
[INFO] ------------------------------------------------------------------------
[INFO] Downloading: http://localhost:8192/maven2/org/apache/maven/plugins/maven-invoker-plugin/1.10/maven-invoker-plugin-1.10.pom
[INFO] Downloaded: http://localhost:8192/maven2/org/apache/maven/plugins/maven-invoker-plugin/1.10/maven-invoker-plugin-1.10.pom (11 KB at 495.2 KB/sec)
[INFO] Downloading: http://localhost:8192/maven2/org/apache/maven/plugins/maven-invoker-plugin/1.10/maven-invoker-plugin-1.10.jar

Continuation...

[INFO] Downloaded: http://localhost:8192/maven2/org/apache/maven/plugins/maven-invoker-plugin/1.10/maven-invoker-plugin-1.10.jar (103 KB at 4882.8 KB/sec)
[INFO] Downloading: http://localhost:8192/maven2/org/apache/maven/plugins/maven-plugin-plugin/3.4/maven-plugin-plugin-3.4.pom
[INFO] Downloaded: http://localhost:8192/maven2/org/apache/maven/plugins/maven-plugin-plugin/3.4/maven-plugin-plugin-3.4.pom (14 KB at 674.4 KB/sec)
[INFO] Downloading: http://localhost:8192/maven2/org/apache/maven/plugin-tools/maven-plugin-tools/3.4/maven-plugin-tools-3.4.pom
[INFO] Downloaded: http://localhost:8192/maven2/org/apache/maven/plugin-tools/maven-plugin-tools/3.4/maven-plugin-tools-3.4.pom (14 KB at 530.9 KB/sec)
[INFO] Downloading: http://localhost:8192/maven2/org/apache/maven/plugins/maven-plugin-plugin/3.4/maven-plugin-plugin-3.4.jar
[INFO] Downloaded: http://localhost:8192/maven2/org/apache/maven/plugins/maven-plugin-plugin/3.4/maven-plugin-plugin-3.4.jar (49 KB at 2319.8 KB/sec)
[INFO] Downloading: http://localhost:8192/maven2/org/mockito/mockito-all/1.10.19/mockito-all-1.10.19.pom
[INFO] Downloaded: http://localhost:8192/maven2/org/mockito/mockito-all/1.10.19/mockito-all-1.10.19.pom (930 B at 47.8 KB/sec)
[INFO] Downloading: http://localhost:8192/maven2/org/apache/maven/wagon/wagon-provider-api/1.0-alpha-5/wagon-provider-api-1.0-alpha-5.pom
[INFO] Downloaded: http://localhost:8192/maven2/org/apache/maven/wagon/wagon-provider-api/1.0-alpha-5/wagon-provider-api-1.0-alpha-5.pom (5 KB at 235.0 KB/sec)
[INFO] Downloading: http://localhost:8192/maven2/org/apache/maven/wagon/wagon-file/1.0-alpha-5/wagon-file-1.0-alpha-5.pom
[INFO] Downloaded: http://localhost:8192/maven2/org/apache/maven/wagon/wagon-file/1.0-alpha-5/wagon-file-1.0-alpha-5.pom (6 KB at 349.7 KB/sec)
[INFO] Downloading: http://localhost:8192/maven2/org/apache/maven/wagon/wagon-http-lightweight/1.0-alpha-5/wagon-http-lightweight-1.0-alpha-5.pom
[INFO] Downloaded: http://localhost:8192/maven2/org/apache/maven/wagon/wagon-http-lightweight/1.0-alpha-5/wagon-http-lightweight-1.0-alpha-5.pom (6 KB at 362.5 KB/sec)
[INFO] Downloading: http://localhost:8192/maven2/org/apache/maven/wagon/wagon-ssh/1.0-alpha-5/wagon-ssh-1.0-alpha-5.pom
[INFO] Downloaded: http://localhost:8192/maven2/org/apache/maven/wagon/wagon-ssh/1.0-alpha-5/wagon-ssh-1.0-alpha-5.pom (7 KB at 363.4 KB/sec)
[INFO] Downloading: http://localhost:8192/maven2/com/jcraft/jsch/0.1.23/jsch-0.1.23.pom
[INFO] Downloaded: http://localhost:8192/maven2/com/jcraft/jsch/0.1.23/jsch-0.1.23.pom (485 B at 29.6 KB/sec)
[INFO] Downloading: http://localhost:8192/maven2/org/mockito/mockito-all/1.10.19/mockito-all-1.10.19.jar
[INFO] Downloading: http://localhost:8192/maven2/org/apache/maven/wagon/wagon-http-lightweight/1.0-alpha-5/wagon-http-lightweight-1.0-alpha-5.jar
[INFO] Downloading: http://localhost:8192/maven2/org/apache/maven/wagon/wagon-file/1.0-alpha-5/wagon-file-1.0-alpha-5.jar
[INFO] Downloading: http://localhost:8192/maven2/org/apache/maven/wagon/wagon-ssh/1.0-alpha-5/wagon-ssh-1.0-alpha-5.jar
[INFO] Downloading: http://localhost:8192/maven2/com/jcraft/jsch/0.1.23/jsch-0.1.23.jar
[INFO] Downloaded: http://localhost:8192/maven2/org/apache/maven/wagon/wagon-http-lightweight/1.0-alpha-5/wagon-http-lightweight-1.0-alpha-5.jar (8 KB at 111.7 KB/sec)
[INFO] Downloaded: http://localhost:8192/maven2/org/apache/maven/wagon/wagon-file/1.0-alpha-5/wagon-file-1.0-alpha-5.jar (6 KB at 81.6 KB/sec)
[INFO] Downloaded: http://localhost:8192/maven2/org/apache/maven/wagon/wagon-ssh/1.0-alpha-5/wagon-ssh-1.0-alpha-5.jar (33 KB at 464.0 KB/sec)
[INFO] Downloaded: http://localhost:8192/maven2/org/mockito/mockito-all/1.10.19/mockito-all-1.10.19.jar (1206 KB at 10217.5 KB/sec)
[INFO] Downloaded: http://localhost:8192/maven2/com/jcraft/jsch/0.1.23/jsch-0.1.23.jar (114 KB at 1194.9 KB/sec)
[INFO] 
[INFO] --- maven-enforcer-plugin:1.4.1:enforce (enforce-bytecode-version) @ apache-rat-plugin ---
[INFO] 
[INFO] --- apache-rat-plugin:0.12:check (default) @ apache-rat-plugin ---
[INFO] Enabled default license matchers.
[INFO] Will parse SCM ignores for exclusions...
[INFO] Finished adding exclusions from SCM ignore files.
[INFO] 61 implicit excludes (use -debug for more details).
[INFO] Exclude: src/it/it1/src.apt
[INFO] Exclude: src/test/resources/unit/it2/src.txt
[INFO] Exclude: src/test/resources/unit/it3/src.apt
[INFO] Exclude: src/test/resources/unit/it4/*.html
[INFO] Exclude: **/*.iml
[INFO] Exclude: **/.bzrignore
[INFO] 39 resources included (use -debug for more details)
[INFO] Rat check: Summary over all files. Unapproved: 0, unknown: 0, generated: 0, approved: 39 licenses.
[INFO] 
[INFO] --- maven-plugin-plugin:3.4:helpmojo (help-goal) @ apache-rat-plugin ---
[INFO] Downloading: http://localhost:8192/maven2/org/apache/maven/plugin-tools/maven-plugin-tools-api/3.4/maven-plugin-tools-api-3.4.pom
[INFO] Downloaded: http://localhost:8192/maven2/org/apache/maven/plugin-tools/maven-plugin-tools-api/3.4/maven-plugin-tools-api-3.4.pom (3 KB at 158.3 KB/sec)
[INFO] Downloading: http://localhost:8192/maven2/org/apache/maven/plugin-tools/maven-plugin-tools-generators/3.4/maven-plugin-tools-generators-3.4.pom
[INFO] Downloaded: http://localhost:8192/maven2/org/apache/maven/plugin-tools/maven-plugin-tools-generators/3.4/maven-plugin-tools-generators-3.4.pom (5 KB at 170.3 KB/sec)
[INFO] Downloading: http://localhost:8192/maven2/net/sf/jtidy/jtidy/r938/jtidy-r938.pom
[INFO] Downloaded: http://localhost:8192/maven2/net/sf/jtidy/jtidy/r938/jtidy-r938.pom (10 KB at 428.9 KB/sec)
[INFO] Downloading: http://localhost:8192/maven2/org/apache/maven/plugin-tools/maven-plugin-tools-java/3.4/maven-plugin-tools-java-3.4.pom
[INFO] Downloaded: http://localhost:8192/maven2/org/apache/maven/plugin-tools/maven-plugin-tools-java/3.4/maven-plugin-tools-java-3.4.pom (4 KB at 163.4 KB/sec)
[INFO] Downloading: http://localhost:8192/maven2/com/thoughtworks/qdox/qdox/2.0-M3/qdox-2.0-M3.pom
[INFO] Downloaded: http://localhost:8192/maven2/com/thoughtworks/qdox/qdox/2.0-M3/qdox-2.0-M3.pom (18 KB at 1042.5 KB/sec)
[INFO] Downloading: http://localhost:8192/maven2/org/apache/maven/plugin-tools/maven-plugin-tools-annotations/3.4/maven-plugin-tools-annotations-3.4.pom
[INFO] Downloaded: http://localhost:8192/maven2/org/apache/maven/plugin-tools/maven-plugin-tools-annotations/3.4/maven-plugin-tools-annotations-3.4.pom (5 KB at 203.5 KB/sec)
[INFO] Downloading: http://localhost:8192/maven2/org/apache/maven/plugin-tools/maven-plugin-annotations/3.4/maven-plugin-annotations-3.4.pom
[INFO] Downloaded: http://localhost:8192/maven2/org/apache/maven/plugin-tools/maven-plugin-annotations/3.4/maven-plugin-annotations-3.4.pom (2 KB at 79.5 KB/sec)
[INFO] Downloading: http://localhost:8192/maven2/org/codehaus/plexus/plexus-archiver/2.1.1/plexus-archiver-2.1.1.pom
[INFO] Downloaded: http://localhost:8192/maven2/org/codehaus/plexus/plexus-archiver/2.1.1/plexus-archiver-2.1.1.pom (3 KB at 152.5 KB/sec)
[INFO] Downloading: http://localhost:8192/maven2/org/codehaus/plexus/plexus-io/2.0.3/plexus-io-2.0.3.pom
[INFO] Downloaded: http://localhost:8192/maven2/org/codehaus/plexus/plexus-io/2.0.3/plexus-io-2.0.3.pom (2 KB at 80.6 KB/sec)
[INFO] Downloading: http://localhost:8192/maven2/org/apache/maven/plugin-tools/maven-plugin-tools-api/3.4/maven-plugin-tools-api-3.4.jar
[INFO] Downloading: http://localhost:8192/maven2/org/apache/maven/plugin-tools/maven-plugin-tools-generators/3.4/maven-plugin-tools-generators-3.4.jar
[INFO] Downloading: http://localhost:8192/maven2/net/sf/jtidy/jtidy/r938/jtidy-r938.jar
[INFO] Downloading: http://localhost:8192/maven2/org/apache/maven/plugin-tools/maven-plugin-tools-java/3.4/maven-plugin-tools-java-3.4.jar
[INFO] Downloading: http://localhost:8192/maven2/com/thoughtworks/qdox/qdox/2.0-M3/qdox-2.0-M3.jar
[INFO] Downloaded: http://localhost:8192/maven2/org/apache/maven/plugin-tools/maven-plugin-tools-java/3.4/maven-plugin-tools-java-3.4.jar (18 KB at 508.9 KB/sec)
[INFO] Downloading: http://localhost:8192/maven2/org/apache/maven/plugin-tools/maven-plugin-tools-annotations/3.4/maven-plugin-tools-annotations-3.4.jar
[INFO] Downloaded: http://localhost:8192/maven2/org/apache/maven/plugin-tools/maven-plugin-tools-api/3.4/maven-plugin-tools-api-3.4.jar (23 KB at 647.2 KB/sec)
[INFO] Downloading: http://localhost:8192/maven2/org/apache/maven/plugin-tools/maven-plugin-annotations/3.4/maven-plugin-annotations-3.4.jar
[INFO] Downloaded: http://localhost:8192/maven2/net/sf/jtidy/jtidy/r938/jtidy-r938.jar (245 KB at 6596.4 KB/sec)
[INFO] Downloading: http://localhost:8192/maven2/org/codehaus/plexus/plexus-archiver/2.1.1/plexus-archiver-2.1.1.jar
[INFO] Downloaded: http://localhost:8192/maven2/org/apache/maven/plugin-tools/maven-plugin-tools-generators/3.4/maven-plugin-tools-generators-3.4.jar (46 KB at 1089.9 KB/sec)
[INFO] Downloading: http://localhost:8192/maven2/org/codehaus/plexus/plexus-io/2.0.3/plexus-io-2.0.3.jar
[INFO] Downloaded: http://localhost:8192/maven2/com/thoughtworks/qdox/qdox/2.0-M3/qdox-2.0-M3.jar (286 KB at 6795.6 KB/sec)
[INFO] Downloaded: http://localhost:8192/maven2/org/apache/maven/plugin-tools/maven-plugin-annotations/3.4/maven-plugin-annotations-3.4.jar (14 KB at 262.5 KB/sec)
[INFO] Downloaded: http://localhost:8192/maven2/org/apache/maven/plugin-tools/maven-plugin-tools-annotations/3.4/maven-plugin-tools-annotations-3.4.jar (41 KB at 717.5 KB/sec)
[INFO] Downloaded: http://localhost:8192/maven2/org/codehaus/plexus/plexus-io/2.0.3/plexus-io-2.0.3.jar (57 KB at 998.5 KB/sec)
[INFO] Downloaded: http://localhost:8192/maven2/org/codehaus/plexus/plexus-archiver/2.1.1/plexus-archiver-2.1.1.jar (181 KB at 2908.0 KB/sec)
[INFO] Using 'UTF-8' encoding to read mojo metadata.
[INFO] Mojo extractor with id: java-javadoc found 0 mojo descriptors.
[INFO] Mojo extractor with id: java-annotations found 0 mojo descriptors.
[INFO] 
[INFO] --- maven-remote-resources-plugin:1.5:process (process-resource-bundles) @ apache-rat-plugin ---
[INFO] 
[INFO] --- maven-resources-plugin:2.7:resources (default-resources) @ apache-rat-plugin ---
[INFO] Using 'UTF-8' encoding to copy filtered resources.
[INFO] Copying 2 resources
[INFO] Copying 1 resource
[INFO] Copying 1 resource to META-INF
[INFO] Copying 3 resources
[INFO] 
[INFO] --- maven-compiler-plugin:3.7.0:compile (default-compile) @ apache-rat-plugin ---
[INFO] Changes detected - recompiling the module!
[INFO] Compiling 11 source files to /srv/gump/public/workspace/rat/apache-rat-plugin/target/classes
[INFO] /srv/gump/public/workspace/rat/apache-rat-plugin/src/main/java/org/apache/rat/mp/RatReportMojo.java: Some input files use or override a deprecated API.
[INFO] /srv/gump/public/workspace/rat/apache-rat-plugin/src/main/java/org/apache/rat/mp/RatReportMojo.java: Recompile with -Xlint:deprecation for details.
[INFO] 
[INFO] --- maven-plugin-plugin:3.4:descriptor (default-descriptor) @ apache-rat-plugin ---
[INFO] Using 'UTF-8' encoding to read mojo metadata.
[INFO] Mojo extractor with id: java-javadoc found 0 mojo descriptors.
[INFO] Mojo extractor with id: java-annotations found 3 mojo descriptors.
[INFO] 
[INFO] --- animal-sniffer-maven-plugin:1.11:check (check-java-1.5-compat) @ apache-rat-plugin ---
[INFO] Checking unresolved references to org.codehaus.mojo.signature:java15:1.0
[INFO] 
[INFO] --- maven-plugin-plugin:3.4:descriptor (mojo-descriptor) @ apache-rat-plugin ---
[INFO] Using 'UTF-8' encoding to read mojo metadata.
[INFO] Mojo extractor with id: java-javadoc found 0 mojo descriptors.
[INFO] Mojo extractor with id: java-annotations found 3 mojo descriptors.
[INFO] 
[INFO] --- maven-resources-plugin:2.7:testResources (default-testResources) @ apache-rat-plugin ---
[INFO] Using 'UTF-8' encoding to copy filtered resources.
[INFO] Copying 8 resources
[INFO] Copying 3 resources
[INFO] 
[INFO] --- maven-compiler-plugin:3.7.0:testCompile (default-testCompile) @ apache-rat-plugin ---
[INFO] Changes detected - recompiling the module!
[INFO] Compiling 4 source files to /srv/gump/public/workspace/rat/apache-rat-plugin/target/test-classes
[INFO] /srv/gump/public/workspace/rat/apache-rat-plugin/src/test/java/org/apache/rat/mp/RatTestHelpers.java: Some input files use or override a deprecated API.
[INFO] /srv/gump/public/workspace/rat/apache-rat-plugin/src/test/java/org/apache/rat/mp/RatTestHelpers.java: Recompile with -Xlint:deprecation for details.
[INFO] 
[INFO] --- maven-surefire-plugin:2.19.1:test (default-test) @ apache-rat-plugin ---
[INFO] Tests are skipped.
[INFO] 
[INFO] --- maven-jar-plugin:3.0.0:jar (default-jar) @ apache-rat-plugin ---
[INFO] Building jar: /srv/gump/public/workspace/rat/apache-rat-plugin/target/apache-rat-plugin-0.13-SNAPSHOT.jar
[INFO] 
[INFO] --- maven-plugin-plugin:3.4:addPluginArtifactMetadata (default-addPluginArtifactMetadata) @ apache-rat-plugin ---
[INFO] 
[INFO] --- maven-site-plugin:3.4:attach-descriptor (attach-descriptor) @ apache-rat-plugin ---
[INFO]                                                                         
[INFO] ------------------------------------------------------------------------
[INFO] Building Apache Creadur Rat::Tasks4Ant 0.13-SNAPSHOT
[INFO] ------------------------------------------------------------------------
[INFO] Downloading: http://localhost:8192/maven2/org/apache/maven/plugins/maven-dependency-plugin/2.8/maven-dependency-plugin-2.8.pom
[INFO] Downloaded: http://localhost:8192/maven2/org/apache/maven/plugins/maven-dependency-plugin/2.8/maven-dependency-plugin-2.8.pom (12 KB at 532.6 KB/sec)
[INFO] Downloading: http://localhost:8192/maven2/org/apache/maven/plugins/maven-dependency-plugin/2.8/maven-dependency-plugin-2.8.jar
[INFO] Downloaded: http://localhost:8192/maven2/org/apache/maven/plugins/maven-dependency-plugin/2.8/maven-dependency-plugin-2.8.jar (150 KB at 7873.4 KB/sec)
[INFO] Downloading: http://localhost:8192/maven2/org/apache/ant/ant/1.9.12/ant-1.9.12.pom
[INFO] Downloaded: http://localhost:8192/maven2/org/apache/ant/ant/1.9.12/ant-1.9.12.pom (10 KB at 442.8 KB/sec)
[INFO] Downloading: http://localhost:8192/maven2/org/apache/ant/ant-parent/1.9.12/ant-parent-1.9.12.pom
[INFO] Downloaded: http://localhost:8192/maven2/org/apache/ant/ant-parent/1.9.12/ant-parent-1.9.12.pom (6 KB at 203.4 KB/sec)
[INFO] Downloading: http://localhost:8192/maven2/org/apache/ant/ant-launcher/1.9.12/ant-launcher-1.9.12.pom
[INFO] Downloaded: http://localhost:8192/maven2/org/apache/ant/ant-launcher/1.9.12/ant-launcher-1.9.12.pom (3 KB at 152.1 KB/sec)
[INFO] Downloading: http://localhost:8192/maven2/org/apache/ant/ant-antunit/1.4/ant-antunit-1.4.pom
[INFO] Downloaded: http://localhost:8192/maven2/org/apache/ant/ant-antunit/1.4/ant-antunit-1.4.pom (4 KB at 202.1 KB/sec)
[INFO] Downloading: http://localhost:8192/maven2/org/apache/ant/ant-testutil/1.9.12/ant-testutil-1.9.12.pom
[INFO] Downloaded: http://localhost:8192/maven2/org/apache/ant/ant-testutil/1.9.12/ant-testutil-1.9.12.pom (3 KB at 192.9 KB/sec)
[INFO] Downloading: http://localhost:8192/maven2/org/apache/ant/ant/1.9.12/ant-1.9.12.jar
[INFO] Downloading: http://localhost:8192/maven2/org/apache/ant/ant-antunit/1.4/ant-antunit-1.4.jar
[INFO] Downloading: http://localhost:8192/maven2/org/apache/ant/ant-launcher/1.9.12/ant-launcher-1.9.12.jar
[INFO] Downloading: http://localhost:8192/maven2/org/apache/ant/ant-testutil/1.9.12/ant-testutil-1.9.12.jar
[INFO] Downloaded: http://localhost:8192/maven2/org/apache/ant/ant-launcher/1.9.12/ant-launcher-1.9.12.jar (19 KB at 919.4 KB/sec)
[INFO] Downloaded: http://localhost:8192/maven2/org/apache/ant/ant-antunit/1.4/ant-antunit-1.4.jar (60 KB at 2299.6 KB/sec)
[INFO] Downloaded: http://localhost:8192/maven2/org/apache/ant/ant-testutil/1.9.12/ant-testutil-1.9.12.jar (28 KB at 1134.2 KB/sec)
[INFO] Downloaded: http://localhost:8192/maven2/org/apache/ant/ant/1.9.12/ant-1.9.12.jar (2166 KB at 33837.6 KB/sec)
[INFO] 
[INFO] --- maven-enforcer-plugin:1.4.1:enforce (enforce-bytecode-version) @ apache-rat-tasks ---
[INFO] 
[INFO] --- apache-rat-plugin:0.12:check (default) @ apache-rat-tasks ---
[INFO] Enabled default license matchers.
[INFO] Will parse SCM ignores for exclusions...
[INFO] Finished adding exclusions from SCM ignore files.
[INFO] 61 implicit excludes (use -debug for more details).
[INFO] Exclude: src/test/resources/antunit/index.apt
[INFO] Exclude: src/test/resources/org/example/*.html
[INFO] 22 resources included (use -debug for more details)
[INFO] Rat check: Summary over all files. Unapproved: 0, unknown: 0, generated: 0, approved: 22 licenses.
[INFO] 
[INFO] --- maven-remote-resources-plugin:1.5:process (process-resource-bundles) @ apache-rat-tasks ---
[INFO] 
[INFO] --- maven-resources-plugin:2.7:resources (default-resources) @ apache-rat-tasks ---
[INFO] Using 'UTF-8' encoding to copy filtered resources.
[INFO] Copying 1 resource
[INFO] skip non existing resourceDirectory /srv/gump/public/workspace/rat/apache-rat-tasks/src/main/filtered-resources
[INFO] Copying 1 resource to META-INF
[INFO] Copying 3 resources
[INFO] 
[INFO] --- maven-compiler-plugin:3.7.0:compile (default-compile) @ apache-rat-tasks ---
[INFO] Changes detected - recompiling the module!
[INFO] Compiling 4 source files to /srv/gump/public/workspace/rat/apache-rat-tasks/target/classes
[INFO] /srv/gump/public/workspace/rat/apache-rat-tasks/src/main/java/org/apache/rat/anttasks/Report.java: /srv/gump/public/workspace/rat/apache-rat-tasks/src/main/java/org/apache/rat/anttasks/Report.java uses or overrides a deprecated API.
[INFO] /srv/gump/public/workspace/rat/apache-rat-tasks/src/main/java/org/apache/rat/anttasks/Report.java: Recompile with -Xlint:deprecation for details.
[INFO] 
[INFO] --- animal-sniffer-maven-plugin:1.11:check (check-java-1.5-compat) @ apache-rat-tasks ---
[INFO] Checking unresolved references to org.codehaus.mojo.signature:java15:1.0
[INFO] 
[INFO] --- maven-dependency-plugin:2.8:copy-dependencies (default) @ apache-rat-tasks ---
[INFO] Downloading: http://localhost:8192/maven2/org/apache/maven/reporting/maven-reporting-impl/2.0.5/maven-reporting-impl-2.0.5.pom
[INFO] Downloaded: http://localhost:8192/maven2/org/apache/maven/reporting/maven-reporting-impl/2.0.5/maven-reporting-impl-2.0.5.pom (5 KB at 196.4 KB/sec)
[INFO] Downloading: http://localhost:8192/maven2/org/apache/maven/shared/maven-doxia-tools/1.0.2/maven-doxia-tools-1.0.2.pom
[INFO] Downloaded: http://localhost:8192/maven2/org/apache/maven/shared/maven-doxia-tools/1.0.2/maven-doxia-tools-1.0.2.pom (6 KB at 409.1 KB/sec)
[INFO] Downloading: http://localhost:8192/maven2/org/codehaus/plexus/plexus-archiver/2.3/plexus-archiver-2.3.pom
[INFO] Downloaded: http://localhost:8192/maven2/org/codehaus/plexus/plexus-archiver/2.3/plexus-archiver-2.3.pom (4 KB at 219.3 KB/sec)
[INFO] Downloading: http://localhost:8192/maven2/org/codehaus/plexus/plexus-io/2.0.6/plexus-io-2.0.6.pom
[INFO] Downloaded: http://localhost:8192/maven2/org/codehaus/plexus/plexus-io/2.0.6/plexus-io-2.0.6.pom (3 KB at 196.3 KB/sec)
[INFO] Downloading: http://localhost:8192/maven2/org/codehaus/plexus/plexus-utils/3.0.9/plexus-utils-3.0.9.pom
[INFO] Downloaded: http://localhost:8192/maven2/org/codehaus/plexus/plexus-utils/3.0.9/plexus-utils-3.0.9.pom (4 KB at 133.4 KB/sec)
[INFO] Downloading: http://localhost:8192/maven2/org/apache/maven/shared/maven-dependency-analyzer/1.4/maven-dependency-analyzer-1.4.pom
[INFO] Downloaded: http://localhost:8192/maven2/org/apache/maven/shared/maven-dependency-analyzer/1.4/maven-dependency-analyzer-1.4.pom (6 KB at 279.6 KB/sec)
[INFO] Downloading: http://localhost:8192/maven2/asm/asm/3.3.1/asm-3.3.1.pom
[INFO] Downloaded: http://localhost:8192/maven2/asm/asm/3.3.1/asm-3.3.1.pom (266 B at 23.6 KB/sec)
[INFO] Downloading: http://localhost:8192/maven2/asm/asm-parent/3.3.1/asm-parent-3.3.1.pom
[INFO] Downloaded: http://localhost:8192/maven2/asm/asm-parent/3.3.1/asm-parent-3.3.1.pom (5 KB at 325.4 KB/sec)
[INFO] Downloading: http://localhost:8192/maven2/org/apache/maven/shared/maven-invoker/2.0.11/maven-invoker-2.0.11.pom

Continuation...

[INFO] Downloaded: http://localhost:8192/maven2/org/apache/maven/shared/maven-invoker/2.0.11/maven-invoker-2.0.11.pom (5 KB at 309.7 KB/sec)
[INFO] Downloading: http://localhost:8192/maven2/org/apache/maven/reporting/maven-reporting-impl/2.0.5/maven-reporting-impl-2.0.5.jar
[INFO] Downloading: http://localhost:8192/maven2/org/apache/maven/shared/maven-doxia-tools/1.0.2/maven-doxia-tools-1.0.2.jar
[INFO] Downloading: http://localhost:8192/maven2/org/codehaus/plexus/plexus-archiver/2.3/plexus-archiver-2.3.jar
[INFO] Downloading: http://localhost:8192/maven2/org/codehaus/plexus/plexus-utils/3.0.9/plexus-utils-3.0.9.jar
[INFO] Downloading: http://localhost:8192/maven2/org/codehaus/plexus/plexus-io/2.0.6/plexus-io-2.0.6.jar
[INFO] Downloaded: http://localhost:8192/maven2/org/apache/maven/shared/maven-doxia-tools/1.0.2/maven-doxia-tools-1.0.2.jar (41 KB at 1383.5 KB/sec)
[INFO] Downloading: http://localhost:8192/maven2/org/apache/maven/shared/maven-dependency-analyzer/1.4/maven-dependency-analyzer-1.4.jar
[INFO] Downloaded: http://localhost:8192/maven2/org/codehaus/plexus/plexus-archiver/2.3/plexus-archiver-2.3.jar (183 KB at 5690.6 KB/sec)
[INFO] Downloading: http://localhost:8192/maven2/asm/asm/3.3.1/asm-3.3.1.jar
[INFO] Downloaded: http://localhost:8192/maven2/org/apache/maven/reporting/maven-reporting-impl/2.0.5/maven-reporting-impl-2.0.5.jar (21 KB at 529.7 KB/sec)
[INFO] Downloading: http://localhost:8192/maven2/org/apache/maven/shared/maven-invoker/2.0.11/maven-invoker-2.0.11.jar
[INFO] Downloaded: http://localhost:8192/maven2/org/codehaus/plexus/plexus-utils/3.0.9/plexus-utils-3.0.9.jar (227 KB at 5960.6 KB/sec)
[INFO] Downloaded: http://localhost:8192/maven2/org/codehaus/plexus/plexus-io/2.0.6/plexus-io-2.0.6.jar (57 KB at 1340.9 KB/sec)
[INFO] Downloaded: http://localhost:8192/maven2/asm/asm/3.3.1/asm-3.3.1.jar (43 KB at 788.1 KB/sec)
[INFO] Downloaded: http://localhost:8192/maven2/org/apache/maven/shared/maven-dependency-analyzer/1.4/maven-dependency-analyzer-1.4.jar (27 KB at 487.1 KB/sec)
[INFO] Downloaded: http://localhost:8192/maven2/org/apache/maven/shared/maven-invoker/2.0.11/maven-invoker-2.0.11.jar (29 KB at 486.7 KB/sec)
[INFO] Copying ant-antunit-1.4.jar to /srv/gump/public/workspace/rat/apache-rat-tasks/target/dependencies/ant-antunit.jar
[INFO] 
[INFO] --- maven-resources-plugin:2.7:testResources (default-testResources) @ apache-rat-tasks ---
[INFO] Using 'UTF-8' encoding to copy filtered resources.
[INFO] Copying 6 resources
[INFO] Copying 3 resources
[INFO] 
[INFO] --- maven-compiler-plugin:3.7.0:testCompile (default-testCompile) @ apache-rat-tasks ---
[INFO] Changes detected - recompiling the module!
[INFO] Compiling 4 source files to /srv/gump/public/workspace/rat/apache-rat-tasks/target/test-classes
[INFO] /srv/gump/public/workspace/rat/apache-rat-tasks/src/test/java/org/apache/rat/anttasks/AbstractRatAntTaskTest.java: Some input files use or override a deprecated API.
[INFO] /srv/gump/public/workspace/rat/apache-rat-tasks/src/test/java/org/apache/rat/anttasks/AbstractRatAntTaskTest.java: Recompile with -Xlint:deprecation for details.
[INFO] 
[INFO] --- maven-surefire-plugin:2.19.1:test (default-test) @ apache-rat-tasks ---
[INFO] Tests are skipped.
[INFO] 
[INFO] --- maven-antrun-plugin:1.8:run (default) @ apache-rat-tasks ---
[INFO] Downloading: http://localhost:8192/maven2/org/apache/ant/ant/1.9.9/ant-1.9.9.pom
[INFO] Downloaded: http://localhost:8192/maven2/org/apache/ant/ant/1.9.9/ant-1.9.9.pom (10 KB at 671.4 KB/sec)
[INFO] Downloading: http://localhost:8192/maven2/org/apache/ant/ant-parent/1.9.9/ant-parent-1.9.9.pom
[INFO] Downloaded: http://localhost:8192/maven2/org/apache/ant/ant-parent/1.9.9/ant-parent-1.9.9.pom (6 KB at 322.0 KB/sec)
[INFO] Downloading: http://localhost:8192/maven2/org/apache/ant/ant-launcher/1.9.9/ant-launcher-1.9.9.pom
[INFO] Downloaded: http://localhost:8192/maven2/org/apache/ant/ant-launcher/1.9.9/ant-launcher-1.9.9.pom (3 KB at 126.7 KB/sec)
[INFO] Downloading: http://localhost:8192/maven2/org/apache/ant/ant/1.9.9/ant-1.9.9.jar
[INFO] Downloading: http://localhost:8192/maven2/org/apache/ant/ant-launcher/1.9.9/ant-launcher-1.9.9.jar
[INFO] Downloaded: http://localhost:8192/maven2/org/apache/ant/ant-launcher/1.9.9/ant-launcher-1.9.9.jar (19 KB at 681.1 KB/sec)
[INFO] Downloaded: http://localhost:8192/maven2/org/apache/ant/ant/1.9.9/ant-1.9.9.jar (2166 KB at 25181.5 KB/sec)
[INFO] Executing tasks

main:

allTests:
[au:antunit] Build File: /srv/gump/public/workspace/rat/apache-rat-tasks/src/test/resources/antunit/report-bad-configurations.xml
[au:antunit] Tests run: 10, Failures: 0, Errors: 0, Time elapsed: 0.411 sec
[au:antunit] Target: testNoStylesheet took 0.003 sec
[au:antunit] Target: testNoResources took 0.001 sec
[au:antunit] Target: testSubstringMatcherRequiresFamilyName took 0.103 sec
[au:antunit] Target: testFullTextMatcherRequiresFamilyName took 0.029 sec
[au:antunit] Target: testUnusedStylesheet took 0.05 sec
[au:antunit] Target: testFullTextMatcherRequiresText took 0.031 sec
[au:antunit] Target: testSubstringMatcherRequiresFamilyCategory took 0.035 sec
[au:antunit] Target: testSubstringMatcherRequiresPattern took 0.057 sec
[au:antunit] Target: testNoLicenseMatchers took 0.001 sec
[au:antunit] Target: testFullTextMatcherRequiresFamilyCategory took 0.024 sec
    [mkdir] Created dir: /srv/gump/public/workspace/rat/apache-rat-tasks/target/testoutput/dest

allTests:
[au:antunit] Build File: /srv/gump/public/workspace/rat/apache-rat-tasks/src/test/resources/antunit/report-normal-operation.xml
[au:antunit] Tests run: 11, Failures: 0, Errors: 6, Time elapsed: 1.349 sec
[au:antunit] Target: testFullTextMatcherNotApprovedSentToFile  caused an ERROR
[au:antunit] 	at line 209, column 55
[au:antunit] 	Message: The following error occurred while executing this line:
[au:antunit] /srv/gump/public/workspace/rat/apache-rat-tasks/src/test/resources/antunit/report-normal-operation.xml:282: expected report to contain '!YASL1 /srv/gump/public/workspace/rat/apache-rat-tasks/src/test/resources/antunit/report-normal-operation.xml' but was '
[au:antunit] *****************************************************
[au:antunit] Summary
[au:antunit] -------
[au:antunit] Generated at: 2018-09-18T19:28:33+00:00
[au:antunit] 
[au:antunit] Notes: 0
[au:antunit] Binaries: 0
[au:antunit] Archives: 0
[au:antunit] Standards: 1
[au:antunit] 
[au:antunit] Apache Licensed: 0
[au:antunit] Generated Documents: 0
[au:antunit] 
[au:antunit] JavaDocs are generated, thus a license header is optional.
[au:antunit] Generated files do not require license headers.
[au:antunit] 
[au:antunit] 1 Unknown Licenses
[au:antunit] 
[au:antunit] *****************************************************
[au:antunit] 
[au:antunit] Files with unapproved licenses:
[au:antunit] 
[au:antunit]   /srv/gump/public/workspace/rat/apache-rat-tasks/src/test/resources/antunit/report-normal-operation.xml
[au:antunit] 
[au:antunit] *****************************************************
[au:antunit] 
[au:antunit] *****************************************************
[au:antunit]   Files with Apache License headers will be marked AL
[au:antunit]   Binary files (which do not require any license headers) will be marked B
[au:antunit]   Compressed archives will be marked A
[au:antunit]   Notices, licenses etc. will be marked N
[au:antunit]  !????? /srv/gump/public/workspace/rat/apache-rat-tasks/src/test/resources/antunit/report-normal-operation.xml
[au:antunit]  
[au:antunit] *****************************************************
[au:antunit] 
[au:antunit]  Printing headers for text files without a valid license header...
[au:antunit]  
[au:antunit] =====================================================
[au:antunit] == File: /srv/gump/public/workspace/rat/apache-rat-tasks/src/test/resources/antunit/report-normal-operation.xml
[au:antunit] =====================================================
[au:antunit] <?xml version='1.0'?>
[au:antunit] <!--
[au:antunit] 
[au:antunit]  Licensed to the Apache Software Foundation (ASF) under one   *
[au:antunit]  or more contributor license agreements.  See the NOTICE file *
[au:antunit]  distributed with this work for additional information        *
[au:antunit]  regarding copyright ownership.  The ASF licenses this file   *
[au:antunit]  to you under the Apache License, Version 2.0 (the            *
[au:antunit]  "License"); you may not use this file except in compliance   *
[au:antunit]  with the License.  You may obtain a copy of the License at   *
[au:antunit]                                                               *
[au:antunit]    http://www.apache.org/licenses/LICENSE-2.0                 *
[au:antunit]                                                               *
[au:antunit]  Unless required by applicable law or agreed to in writing,   *
[au:antunit]  software distributed under the License is distributed on an  *
[au:antunit]  "AS IS" BASIS, WITHOUT WARRANTIES OR CONDITIONS OF ANY       *
[au:antunit]  KIND, either express or implied.  See the License for the    *
[au:antunit]  specific language governing permissions and limitations      *
[au:antunit]  under the License.                                           *
[au:antunit] 
[au:antunit] -->
[au:antunit] 
[au:antunit] <project name='report-normal-operation'
[au:antunit]     default="allTests"
[au:antunit]     xmlns:au="antlib:org.apache.ant.antunit"
[au:antunit]     xmlns:rat="antlib:org.apache.rat.anttasks">
[au:antunit] 
[au:antunit]   <property name="output.dir" location="../../../../target/testoutput"/>
[au:antunit]   <mkdir dir="/srv/gump/public/workspace/rat/apache-rat-tasks/target/testoutput/dest"/>
[au:antunit]   <path id="all-classes-needed-for-tests">
[au:antunit]     <pathelement location="/srv/gump/public/workspace/rat/apache-rat-tasks/target/classes" />
[au:antunit]     <pathelement path="/srv/gump/public/workspace/rat/apache-rat-tasks/target/test-classes:/srv/gump/public/workspace/rat/apache-rat-tasks/target/classes:/srv/gump/public/workspace/rat/apache-rat-core/target/apache-rat-core-0.13-SNAPSHOT.jar:/srv/gump/public/workspace/rat/apache-rat-api/target/apache-rat-api-0.13-SNAPSHOT.jar:/srv/gump/public/workspace/mvnlocalrepo/shared/commons-collections/commons-collections/3.2.2/commons-collections-3.2.2.jar:/srv/gump/public/workspace/mvnlocalrepo/shared/commons-lang/commons-lang/2.6/commons-lang-2.6.jar:/srv/gump/public/workspace/mvnlocalrepo/shared/commons-io/commons-io/2.2/commons-io-2.2.jar:/srv/gump/public/workspace/mvnlocalrepo/shared/org/apache/commons/commons-compress/1.11/commons-compress-1.11.jar:/srv/gump/public/workspace/mvnlocalrepo/shared/commons-cli/commons-cli/1.3.1/commons-cli-1.3.1.jar:/srv/gump/public/workspace/mvnlocalrepo/shared/org/apache/ant/ant/1.9.12/ant-1.9.12.jar:/srv/gump/public/workspace/mvnlocalrepo/shared/org/apache/ant/ant-launcher/1.9.12/ant-launcher-1.9.12.jar:/srv/gump/public/workspace/mvnlocalrepo/shared/org/apache/ant/ant-antunit/1.4/ant-antunit-1.4.jar:/srv/gump/public/workspace/mvnlocalrepo/shared/junit/junit/4.12/junit-4.12.jar:/srv/gump/public/workspace/mvnlocalrepo/shared/org/hamcrest/hamcrest-core/1.3/hamcrest-core-1.3.jar:/srv/gump/public/workspace/mvnlocalrepo/shared/org/apache/ant/ant-testutil/1.9.12/ant-testutil-1.9.12.jar" />
[au:antunit]     <pathelement location="/srv/gump/public/workspace/rat/apache-rat-tasks/target/testoutput/dest" />
[au:antunit]   </path>
[au:antunit] 
[au:antunit]   <taskdef uri="antlib:org.apache.ant.antunit" 
[au:antunit]            resource="org/apache/ant/antunit/antlib.xml" 
[au:antunit]            classpathref="all-classes-needed-for-tests"
[au:antunit]            loaderref="testloader"/>
[au:antunit] 
[au:antunit]   <taskdef uri="antlib:org.apache.rat.anttasks"
[au:antunit]            resource="org/apache/rat/anttasks/antlib.xml"
[au:antunit]            classpathref="all-classes-needed-for-tests"
[au:antunit]            loaderref="testloader"/>
[au:antunit] 
[au:antunit]   <target name="setUp">
[au:antunit]     <pathconvert dirsep="/" property="file.name">
[au:antunit]       <path>
[au:antunit]         <pathelement location="/srv/gump/public/workspace/rat/apache-rat-tasks/src/test/resources/antunit/report-normal-operation.xml"/>
[au:antunit]       </path>
[au:antunit] '
[au:antunit] 	took 0.113 sec
[au:antunit] Target: testFullTextMatcherSentToFileNoMatch took 0.075 sec
[au:antunit] Target: testFullTextMatcherApprovedSentToFile  caused an ERROR
[au:antunit] 	at line 227, column 55
[au:antunit] 	Message: The following error occurred while executing this line:
[au:antunit] /srv/gump/public/workspace/rat/apache-rat-tasks/src/test/resources/antunit/report-normal-operation.xml:282: expected report to contain ' YASL1 /srv/gump/public/workspace/rat/apache-rat-tasks/src/test/resources/antunit/report-normal-operation.xml' but was '
[au:antunit] *****************************************************
[au:antunit] Summary
[au:antunit] -------
[au:antunit] Generated at: 2018-09-18T19:28:33+00:00
[au:antunit] 
[au:antunit] Notes: 0
[au:antunit] Binaries: 0
[au:antunit] Archives: 0
[au:antunit] Standards: 1
[au:antunit] 
[au:antunit] Apache Licensed: 0
[au:antunit] Generated Documents: 0
[au:antunit] 
[au:antunit] JavaDocs are generated, thus a license header is optional.
[au:antunit] Generated files do not require license headers.
[au:antunit] 
[au:antunit] 1 Unknown Licenses
[au:antunit] 
[au:antunit] *****************************************************
[au:antunit] 
[au:antunit] Files with unapproved licenses:
[au:antunit] 
[au:antunit]   /srv/gump/public/workspace/rat/apache-rat-tasks/src/test/resources/antunit/report-normal-operation.xml
[au:antunit] 
[au:antunit] *****************************************************
[au:antunit] 
[au:antunit] *****************************************************
[au:antunit]   Files with Apache License headers will be marked AL
[au:antunit]   Binary files (which do not require any license headers) will be marked B
[au:antunit]   Compressed archives will be marked A
[au:antunit]   Notices, licenses etc. will be marked N
[au:antunit]  !????? /srv/gump/public/workspace/rat/apache-rat-tasks/src/test/resources/antunit/report-normal-operation.xml
[au:antunit]  
[au:antunit] *****************************************************
[au:antunit] 
[au:antunit]  Printing headers for text files without a valid license header...
[au:antunit]  
[au:antunit] =====================================================
[au:antunit] == File: /srv/gump/public/workspace/rat/apache-rat-tasks/src/test/resources/antunit/report-normal-operation.xml
[au:antunit] =====================================================
[au:antunit] <?xml version='1.0'?>
[au:antunit] <!--
[au:antunit] 
[au:antunit]  Licensed to the Apache Software Foundation (ASF) under one   *
[au:antunit]  or more contributor license agreements.  See the NOTICE file *
[au:antunit]  distributed with this work for additional information        *
[au:antunit]  regarding copyright ownership.  The ASF licenses this file   *
[au:antunit]  to you under the Apache License, Version 2.0 (the            *
[au:antunit]  "License"); you may not use this file except in compliance   *
[au:antunit]  with the License.  You may obtain a copy of the License at   *
[au:antunit]                                                               *
[au:antunit]    http://www.apache.org/licenses/LICENSE-2.0                 *
[au:antunit]                                                               *
[au:antunit]  Unless required by applicable law or agreed to in writing,   *
[au:antunit]  software distributed under the License is distributed on an  *
[au:antunit]  "AS IS" BASIS, WITHOUT WARRANTIES OR CONDITIONS OF ANY       *
[au:antunit]  KIND, either express or implied.  See the License for the    *
[au:antunit]  specific language governing permissions and limitations      *
[au:antunit]  under the License.                                           *
[au:antunit] 
[au:antunit] -->
[au:antunit] 
[au:antunit] <project name='report-normal-operation'
[au:antunit]     default="allTests"
[au:antunit]     xmlns:au="antlib:org.apache.ant.antunit"
[au:antunit]     xmlns:rat="antlib:org.apache.rat.anttasks">
[au:antunit] 
[au:antunit]   <property name="output.dir" location="../../../../target/testoutput"/>
[au:antunit]   <mkdir dir="/srv/gump/public/workspace/rat/apache-rat-tasks/target/testoutput/dest"/>
[au:antunit]   <path id="all-classes-needed-for-tests">
[au:antunit]     <pathelement location="/srv/gump/public/workspace/rat/apache-rat-tasks/target/classes" />
[au:antunit]     <pathelement path="/srv/gump/public/workspace/rat/apache-rat-tasks/target/test-classes:/srv/gump/public/workspace/rat/apache-rat-tasks/target/classes:/srv/gump/public/workspace/rat/apache-rat-core/target/apache-rat-core-0.13-SNAPSHOT.jar:/srv/gump/public/workspace/rat/apache-rat-api/target/apache-rat-api-0.13-SNAPSHOT.jar:/srv/gump/public/workspace/mvnlocalrepo/shared/commons-collections/commons-collections/3.2.2/commons-collections-3.2.2.jar:/srv/gump/public/workspace/mvnlocalrepo/shared/commons-lang/commons-lang/2.6/commons-lang-2.6.jar:/srv/gump/public/workspace/mvnlocalrepo/shared/commons-io/commons-io/2.2/commons-io-2.2.jar:/srv/gump/public/workspace/mvnlocalrepo/shared/org/apache/commons/commons-compress/1.11/commons-compress-1.11.jar:/srv/gump/public/workspace/mvnlocalrepo/shared/commons-cli/commons-cli/1.3.1/commons-cli-1.3.1.jar:/srv/gump/public/workspace/mvnlocalrepo/shared/org/apache/ant/ant/1.9.12/ant-1.9.12.jar:/srv/gump/public/workspace/mvnlocalrepo/shared/org/apache/ant/ant-launcher/1.9.12/ant-launcher-1.9.12.jar:/srv/gump/public/workspace/mvnlocalrepo/shared/org/apache/ant/ant-antunit/1.4/ant-antunit-1.4.jar:/srv/gump/public/workspace/mvnlocalrepo/shared/junit/junit/4.12/junit-4.12.jar:/srv/gump/public/workspace/mvnlocalrepo/shared/org/hamcrest/hamcrest-core/1.3/hamcrest-core-1.3.jar:/srv/gump/public/workspace/mvnlocalrepo/shared/org/apache/ant/ant-testutil/1.9.12/ant-testutil-1.9.12.jar" />
[au:antunit]     <pathelement location="/srv/gump/public/workspace/rat/apache-rat-tasks/target/testoutput/dest" />
[au:antunit]   </path>
[au:antunit] 
[au:antunit]   <taskdef uri="antlib:org.apache.ant.antunit" 
[au:antunit]            resource="org/apache/ant/antunit/antlib.xml" 
[au:antunit]            classpathref="all-classes-needed-for-tests"
[au:antunit]            loaderref="testloader"/>
[au:antunit] 
[au:antunit]   <taskdef uri="antlib:org.apache.rat.anttasks"
[au:antunit]            resource="org/apache/rat/anttasks/antlib.xml"
[au:antunit]            classpathref="all-classes-needed-for-tests"
[au:antunit]            loaderref="testloader"/>
[au:antunit] 
[au:antunit]   <target name="setUp">
[au:antunit]     <pathconvert dirsep="/" property="file.name">
[au:antunit]       <path>
[au:antunit]         <pathelement location="/srv/gump/public/workspace/rat/apache-rat-tasks/src/test/resources/antunit/report-normal-operation.xml"/>
[au:antunit]       </path>
[au:antunit] '
[au:antunit] 	took 0.098 sec
[au:antunit] Target: testFullTextMatcherExpandsProperties  caused an ERROR
[au:antunit] 	at line 270, column 59
[au:antunit] 	Message: The following error occurred while executing this line:
[au:antunit] /srv/gump/public/workspace/rat/apache-rat-tasks/src/test/resources/antunit/report-normal-operation.xml:282: expected report to contain '!YASL1 /srv/gump/public/workspace/rat/apache-rat-tasks/src/test/resources/antunit/report-bad-configurations.xml' but was '
[au:antunit] *****************************************************
[au:antunit] Summary
[au:antunit] -------
[au:antunit] Generated at: 2018-09-18T19:28:33+00:00
[au:antunit] 
[au:antunit] Notes: 0
[au:antunit] Binaries: 0
[au:antunit] Archives: 0
[au:antunit] Standards: 1
[au:antunit] 
[au:antunit] Apache Licensed: 0
[au:antunit] Generated Documents: 0
[au:antunit] 
[au:antunit] JavaDocs are generated, thus a license header is optional.

Continuation...

[au:antunit] Generated files do not require license headers.
[au:antunit] 
[au:antunit] 1 Unknown Licenses
[au:antunit] 
[au:antunit] *****************************************************
[au:antunit] 
[au:antunit] Files with unapproved licenses:
[au:antunit] 
[au:antunit]   /srv/gump/public/workspace/rat/apache-rat-tasks/src/test/resources/antunit/report-bad-configurations.xml
[au:antunit] 
[au:antunit] *****************************************************
[au:antunit] 
[au:antunit] *****************************************************
[au:antunit]   Files with Apache License headers will be marked AL
[au:antunit]   Binary files (which do not require any license headers) will be marked B
[au:antunit]   Compressed archives will be marked A
[au:antunit]   Notices, licenses etc. will be marked N
[au:antunit]  !????? /srv/gump/public/workspace/rat/apache-rat-tasks/src/test/resources/antunit/report-bad-configurations.xml
[au:antunit]  
[au:antunit] *****************************************************
[au:antunit] 
[au:antunit]  Printing headers for text files without a valid license header...
[au:antunit]  
[au:antunit] =====================================================
[au:antunit] == File: /srv/gump/public/workspace/rat/apache-rat-tasks/src/test/resources/antunit/report-bad-configurations.xml
[au:antunit] =====================================================
[au:antunit] <?xml version='1.0'?>
[au:antunit] <!--
[au:antunit] 
[au:antunit]  Licensed to the Apache Software Foundation (ASF) under one   *
[au:antunit]  or more contributor license agreements.  See the NOTICE file *
[au:antunit]  distributed with this work for additional information        *
[au:antunit]  regarding copyright ownership.  The ASF licenses this file   *
[au:antunit]  to you under the Apache License, Version 2.0 (the            *
[au:antunit]  "License"); you may not use this file except in compliance   *
[au:antunit]  with the License.  You may obtain a copy of the License at   *
[au:antunit]                                                               *
[au:antunit]    http://www.apache.org/licenses/LICENSE-2.0                 *
[au:antunit]                                                               *
[au:antunit]  Unless required by applicable law or agreed to in writing,   *
[au:antunit]  software distributed under the License is distributed on an  *
[au:antunit]  "AS IS" BASIS, WITHOUT WARRANTIES OR CONDITIONS OF ANY       *
[au:antunit]  KIND, either express or implied.  See the License for the    *
[au:antunit]  specific language governing permissions and limitations      *
[au:antunit]  under the License.                                           *
[au:antunit] 
[au:antunit] -->
[au:antunit] 
[au:antunit] <project default="allTests"
[au:antunit]     name='report-bad-configurations'
[au:antunit]     xmlns:au="antlib:org.apache.ant.antunit"
[au:antunit]     xmlns:rat="antlib:org.apache.rat.anttasks">
[au:antunit]     
[au:antunit]   <taskdef uri="antlib:org.apache.ant.antunit"
[au:antunit]       resource="org/apache/ant/antunit/antlib.xml"
[au:antunit]       classpath="/srv/gump/public/workspace/rat/apache-rat-tasks/target/test-classes:/srv/gump/public/workspace/rat/apache-rat-tasks/target/classes:/srv/gump/public/workspace/rat/apache-rat-core/target/apache-rat-core-0.13-SNAPSHOT.jar:/srv/gump/public/workspace/rat/apache-rat-api/target/apache-rat-api-0.13-SNAPSHOT.jar:/srv/gump/public/workspace/mvnlocalrepo/shared/commons-collections/commons-collections/3.2.2/commons-collections-3.2.2.jar:/srv/gump/public/workspace/mvnlocalrepo/shared/commons-lang/commons-lang/2.6/commons-lang-2.6.jar:/srv/gump/public/workspace/mvnlocalrepo/shared/commons-io/commons-io/2.2/commons-io-2.2.jar:/srv/gump/public/workspace/mvnlocalrepo/shared/org/apache/commons/commons-compress/1.11/commons-compress-1.11.jar:/srv/gump/public/workspace/mvnlocalrepo/shared/commons-cli/commons-cli/1.3.1/commons-cli-1.3.1.jar:/srv/gump/public/workspace/mvnlocalrepo/shared/org/apache/ant/ant/1.9.12/ant-1.9.12.jar:/srv/gump/public/workspace/mvnlocalrepo/shared/org/apache/ant/ant-launcher/1.9.12/ant-launcher-1.9.12.jar:/srv/gump/public/workspace/mvnlocalrepo/shared/org/apache/ant/ant-antunit/1.4/ant-antunit-1.4.jar:/srv/gump/public/workspace/mvnlocalrepo/shared/junit/junit/4.12/junit-4.12.jar:/srv/gump/public/workspace/mvnlocalrepo/shared/org/hamcrest/hamcrest-core/1.3/hamcrest-core-1.3.jar:/srv/gump/public/workspace/mvnlocalrepo/shared/org/apache/ant/ant-testutil/1.9.12/ant-testutil-1.9.12.jar" />
[au:antunit] 
[au:antunit]   <taskdef uri="antlib:org.apache.rat.anttasks" resource="org/apache/rat/anttasks/antlib.xml">
[au:antunit]     <classpath>
[au:antunit]       <pathelement location="/srv/gump/public/workspace/rat/apache-rat-tasks/target/classes" />
[au:antunit]       <pathelement path='/srv/gump/public/workspace/rat/apache-rat-tasks/target/test-classes:/srv/gump/public/workspace/rat/apache-rat-tasks/target/classes:/srv/gump/public/workspace/rat/apache-rat-core/target/apache-rat-core-0.13-SNAPSHOT.jar:/srv/gump/public/workspace/rat/apache-rat-api/target/apache-rat-api-0.13-SNAPSHOT.jar:/srv/gump/public/workspace/mvnlocalrepo/shared/commons-collections/commons-collections/3.2.2/commons-collections-3.2.2.jar:/srv/gump/public/workspace/mvnlocalrepo/shared/commons-lang/commons-lang/2.6/commons-lang-2.6.jar:/srv/gump/public/workspace/mvnlocalrepo/shared/commons-io/commons-io/2.2/commons-io-2.2.jar:/srv/gump/public/workspace/mvnlocalrepo/shared/org/apache/commons/commons-compress/1.11/commons-compress-1.11.jar:/srv/gump/public/workspace/mvnlocalrepo/shared/commons-cli/commons-cli/1.3.1/commons-cli-1.3.1.jar:/srv/gump/public/workspace/mvnlocalrepo/shared/org/apache/ant/ant/1.9.12/ant-1.9.12.jar:/srv/gump/public/workspace/mvnlocalrepo/shared/org/apache/ant/ant-launcher/1.9.12/ant-launcher-1.9.12.jar:/srv/gump/public/workspace/mvnlocalrepo/shared/org/apache/ant/ant-antunit/1.4/ant-antunit-1.4.jar:/srv/gump/public/workspace/mvnlocalrepo/shared/junit/junit/4.12/junit-4.12.jar:/srv/gump/public/workspace/mvnlocalrepo/shared/org/hamcrest/hamcrest-core/1.3/hamcrest-core-1.3.jar:/srv/gump/public/workspace/mvnlocalrepo/shared/org/apache/ant/ant-testutil/1.9.12/ant-testutil-1.9.12.jar' />
[au:antunit]     </classpath>
[au:antunit]   </taskdef>
[au:antunit] 
[au:antunit]   <target name="allTests">
[au:antunit]     <au:antunit xmlns:au="antlib:org.apache.ant.antunit"
[au:antunit]                 failonerror="true">
[au:antunit]       <file file="/srv/gump/public/workspace/rat/apache-rat-tasks/src/test/resources/antunit/report-normal-operation.xml"/>
[au:antunit]       <au:plainlistener />
[au:antunit]     </au:antunit>
[au:antunit]   </target>
[au:antunit] 
[au:antunit]   <target name="testNoResources">
[au:antunit]     <au:expectfailure expectedMessage="at least one file">
[au:antunit]       <rat:report/>
[au:antunit]     </au:expectfailure>
[au:antunit] '
[au:antunit] 	took 0.068 sec
[au:antunit] Target: testXMLReportSentToFile took 0.053 sec
[au:antunit] Target: testSubstringMatcherApprovedSentToFile  caused an ERROR
[au:antunit] 	at line 173, column 55
[au:antunit] 	Message: The following error occurred while executing this line:
[au:antunit] /srv/gump/public/workspace/rat/apache-rat-tasks/src/test/resources/antunit/report-normal-operation.xml:282: expected report to contain ' YASL1 /srv/gump/public/workspace/rat/apache-rat-tasks/src/test/resources/antunit/report-normal-operation.xml' but was '
[au:antunit] *****************************************************
[au:antunit] Summary
[au:antunit] -------
[au:antunit] Generated at: 2018-09-18T19:28:33+00:00
[au:antunit] 
[au:antunit] Notes: 0
[au:antunit] Binaries: 0
[au:antunit] Archives: 0
[au:antunit] Standards: 1
[au:antunit] 
[au:antunit] Apache Licensed: 0
[au:antunit] Generated Documents: 0
[au:antunit] 
[au:antunit] JavaDocs are generated, thus a license header is optional.
[au:antunit] Generated files do not require license headers.
[au:antunit] 
[au:antunit] 1 Unknown Licenses
[au:antunit] 
[au:antunit] *****************************************************
[au:antunit] 
[au:antunit] Files with unapproved licenses:
[au:antunit] 
[au:antunit]   /srv/gump/public/workspace/rat/apache-rat-tasks/src/test/resources/antunit/report-normal-operation.xml
[au:antunit] 
[au:antunit] *****************************************************
[au:antunit] 
[au:antunit] *****************************************************
[au:antunit]   Files with Apache License headers will be marked AL
[au:antunit]   Binary files (which do not require any license headers) will be marked B
[au:antunit]   Compressed archives will be marked A
[au:antunit]   Notices, licenses etc. will be marked N
[au:antunit]  !????? /srv/gump/public/workspace/rat/apache-rat-tasks/src/test/resources/antunit/report-normal-operation.xml
[au:antunit]  
[au:antunit] *****************************************************
[au:antunit] 
[au:antunit]  Printing headers for text files without a valid license header...
[au:antunit]  
[au:antunit] =====================================================
[au:antunit] == File: /srv/gump/public/workspace/rat/apache-rat-tasks/src/test/resources/antunit/report-normal-operation.xml
[au:antunit] =====================================================
[au:antunit] <?xml version='1.0'?>
[au:antunit] <!--
[au:antunit] 
[au:antunit]  Licensed to the Apache Software Foundation (ASF) under one   *
[au:antunit]  or more contributor license agreements.  See the NOTICE file *
[au:antunit]  distributed with this work for additional information        *
[au:antunit]  regarding copyright ownership.  The ASF licenses this file   *
[au:antunit]  to you under the Apache License, Version 2.0 (the            *
[au:antunit]  "License"); you may not use this file except in compliance   *
[au:antunit]  with the License.  You may obtain a copy of the License at   *
[au:antunit]                                                               *
[au:antunit]    http://www.apache.org/licenses/LICENSE-2.0                 *
[au:antunit]                                                               *
[au:antunit]  Unless required by applicable law or agreed to in writing,   *
[au:antunit]  software distributed under the License is distributed on an  *
[au:antunit]  "AS IS" BASIS, WITHOUT WARRANTIES OR CONDITIONS OF ANY       *
[au:antunit]  KIND, either express or implied.  See the License for the    *
[au:antunit]  specific language governing permissions and limitations      *
[au:antunit]  under the License.                                           *
[au:antunit] 
[au:antunit] -->
[au:antunit] 
[au:antunit] <project name='report-normal-operation'
[au:antunit]     default="allTests"
[au:antunit]     xmlns:au="antlib:org.apache.ant.antunit"
[au:antunit]     xmlns:rat="antlib:org.apache.rat.anttasks">
[au:antunit] 
[au:antunit]   <property name="output.dir" location="../../../../target/testoutput"/>
[au:antunit]   <mkdir dir="/srv/gump/public/workspace/rat/apache-rat-tasks/target/testoutput/dest"/>
[au:antunit]   <path id="all-classes-needed-for-tests">
[au:antunit]     <pathelement location="/srv/gump/public/workspace/rat/apache-rat-tasks/target/classes" />
[au:antunit]     <pathelement path="/srv/gump/public/workspace/rat/apache-rat-tasks/target/test-classes:/srv/gump/public/workspace/rat/apache-rat-tasks/target/classes:/srv/gump/public/workspace/rat/apache-rat-core/target/apache-rat-core-0.13-SNAPSHOT.jar:/srv/gump/public/workspace/rat/apache-rat-api/target/apache-rat-api-0.13-SNAPSHOT.jar:/srv/gump/public/workspace/mvnlocalrepo/shared/commons-collections/commons-collections/3.2.2/commons-collections-3.2.2.jar:/srv/gump/public/workspace/mvnlocalrepo/shared/commons-lang/commons-lang/2.6/commons-lang-2.6.jar:/srv/gump/public/workspace/mvnlocalrepo/shared/commons-io/commons-io/2.2/commons-io-2.2.jar:/srv/gump/public/workspace/mvnlocalrepo/shared/org/apache/commons/commons-compress/1.11/commons-compress-1.11.jar:/srv/gump/public/workspace/mvnlocalrepo/shared/commons-cli/commons-cli/1.3.1/commons-cli-1.3.1.jar:/srv/gump/public/workspace/mvnlocalrepo/shared/org/apache/ant/ant/1.9.12/ant-1.9.12.jar:/srv/gump/public/workspace/mvnlocalrepo/shared/org/apache/ant/ant-launcher/1.9.12/ant-launcher-1.9.12.jar:/srv/gump/public/workspace/mvnlocalrepo/shared/org/apache/ant/ant-antunit/1.4/ant-antunit-1.4.jar:/srv/gump/public/workspace/mvnlocalrepo/shared/junit/junit/4.12/junit-4.12.jar:/srv/gump/public/workspace/mvnlocalrepo/shared/org/hamcrest/hamcrest-core/1.3/hamcrest-core-1.3.jar:/srv/gump/public/workspace/mvnlocalrepo/shared/org/apache/ant/ant-testutil/1.9.12/ant-testutil-1.9.12.jar" />
[au:antunit]     <pathelement location="/srv/gump/public/workspace/rat/apache-rat-tasks/target/testoutput/dest" />
[au:antunit]   </path>
[au:antunit] 
[au:antunit]   <taskdef uri="antlib:org.apache.ant.antunit" 
[au:antunit]            resource="org/apache/ant/antunit/antlib.xml" 
[au:antunit]            classpathref="all-classes-needed-for-tests"
[au:antunit]            loaderref="testloader"/>
[au:antunit] 
[au:antunit]   <taskdef uri="antlib:org.apache.rat.anttasks"
[au:antunit]            resource="org/apache/rat/anttasks/antlib.xml"
[au:antunit]            classpathref="all-classes-needed-for-tests"
[au:antunit]            loaderref="testloader"/>
[au:antunit] 
[au:antunit]   <target name="setUp">
[au:antunit]     <pathconvert dirsep="/" property="file.name">
[au:antunit]       <path>
[au:antunit]         <pathelement location="/srv/gump/public/workspace/rat/apache-rat-tasks/src/test/resources/antunit/report-normal-operation.xml"/>
[au:antunit]       </path>
[au:antunit] '
[au:antunit] 	took 0.068 sec
[au:antunit] Target: testSubstringMatcherSentToFileNoMatch took 0.079 sec
[au:antunit] Target: testSubstringMatcherNotApprovedSentToFile  caused an ERROR
[au:antunit] 	at line 155, column 55
[au:antunit] 	Message: The following error occurred while executing this line:
[au:antunit] /srv/gump/public/workspace/rat/apache-rat-tasks/src/test/resources/antunit/report-normal-operation.xml:282: expected report to contain '!YASL1 /srv/gump/public/workspace/rat/apache-rat-tasks/src/test/resources/antunit/report-normal-operation.xml' but was '
[au:antunit] *****************************************************
[au:antunit] Summary
[au:antunit] -------
[au:antunit] Generated at: 2018-09-18T19:28:34+00:00
[au:antunit] 
[au:antunit] Notes: 0
[au:antunit] Binaries: 0
[au:antunit] Archives: 0
[au:antunit] Standards: 1
[au:antunit] 
[au:antunit] Apache Licensed: 0
[au:antunit] Generated Documents: 0
[au:antunit] 
[au:antunit] JavaDocs are generated, thus a license header is optional.
[au:antunit] Generated files do not require license headers.
[au:antunit] 
[au:antunit] 1 Unknown Licenses
[au:antunit] 
[au:antunit] *****************************************************
[au:antunit] 
[au:antunit] Files with unapproved licenses:
[au:antunit] 
[au:antunit]   /srv/gump/public/workspace/rat/apache-rat-tasks/src/test/resources/antunit/report-normal-operation.xml
[au:antunit] 
[au:antunit] *****************************************************
[au:antunit] 
[au:antunit] *****************************************************
[au:antunit]   Files with Apache License headers will be marked AL
[au:antunit]   Binary files (which do not require any license headers) will be marked B
[au:antunit]   Compressed archives will be marked A
[au:antunit]   Notices, licenses etc. will be marked N
[au:antunit]  !????? /srv/gump/public/workspace/rat/apache-rat-tasks/src/test/resources/antunit/report-normal-operation.xml
[au:antunit]  
[au:antunit] *****************************************************
[au:antunit] 
[au:antunit]  Printing headers for text files without a valid license header...
[au:antunit]  
[au:antunit] =====================================================
[au:antunit] == File: /srv/gump/public/workspace/rat/apache-rat-tasks/src/test/resources/antunit/report-normal-operation.xml
[au:antunit] =====================================================
[au:antunit] <?xml version='1.0'?>
[au:antunit] <!--
[au:antunit] 
[au:antunit]  Licensed to the Apache Software Foundation (ASF) under one   *
[au:antunit]  or more contributor license agreements.  See the NOTICE file *
[au:antunit]  distributed with this work for additional information        *
[au:antunit]  regarding copyright ownership.  The ASF licenses this file   *
[au:antunit]  to you under the Apache License, Version 2.0 (the            *
[au:antunit]  "License"); you may not use this file except in compliance   *
[au:antunit]  with the License.  You may obtain a copy of the License at   *
[au:antunit]                                                               *
[au:antunit]    http://www.apache.org/licenses/LICENSE-2.0                 *
[au:antunit]                                                               *
[au:antunit]  Unless required by applicable law or agreed to in writing,   *
[au:antunit]  software distributed under the License is distributed on an  *
[au:antunit]  "AS IS" BASIS, WITHOUT WARRANTIES OR CONDITIONS OF ANY       *
[au:antunit]  KIND, either express or implied.  See the License for the    *
[au:antunit]  specific language governing permissions and limitations      *
[au:antunit]  under the License.                                           *
[au:antunit] 
[au:antunit] -->
[au:antunit] 
[au:antunit] <project name='report-normal-operation'
[au:antunit]     default="allTests"
[au:antunit]     xmlns:au="antlib:org.apache.ant.antunit"
[au:antunit]     xmlns:rat="antlib:org.apache.rat.anttasks">
[au:antunit] 
[au:antunit]   <property name="output.dir" location="../../../../target/testoutput"/>
[au:antunit]   <mkdir dir="/srv/gump/public/workspace/rat/apache-rat-tasks/target/testoutput/dest"/>
[au:antunit]   <path id="all-classes-needed-for-tests">
[au:antunit]     <pathelement location="/srv/gump/public/workspace/rat/apache-rat-tasks/target/classes" />
[au:antunit]     <pathelement path="/srv/gump/public/workspace/rat/apache-rat-tasks/target/test-classes:/srv/gump/public/workspace/rat/apache-rat-tasks/target/classes:/srv/gump/public/workspace/rat/apache-rat-core/target/apache-rat-core-0.13-SNAPSHOT.jar:/srv/gump/public/workspace/rat/apache-rat-api/target/apache-rat-api-0.13-SNAPSHOT.jar:/srv/gump/public/workspace/mvnlocalrepo/shared/commons-collections/commons-collections/3.2.2/commons-collections-3.2.2.jar:/srv/gump/public/workspace/mvnlocalrepo/shared/commons-lang/commons-lang/2.6/commons-lang-2.6.jar:/srv/gump/public/workspace/mvnlocalrepo/shared/commons-io/commons-io/2.2/commons-io-2.2.jar:/srv/gump/public/workspace/mvnlocalrepo/shared/org/apache/commons/commons-compress/1.11/commons-compress-1.11.jar:/srv/gump/public/workspace/mvnlocalrepo/shared/commons-cli/commons-cli/1.3.1/commons-cli-1.3.1.jar:/srv/gump/public/workspace/mvnlocalrepo/shared/org/apache/ant/ant/1.9.12/ant-1.9.12.jar:/srv/gump/public/workspace/mvnlocalrepo/shared/org/apache/ant/ant-launcher/1.9.12/ant-launcher-1.9.12.jar:/srv/gump/public/workspace/mvnlocalrepo/shared/org/apache/ant/ant-antunit/1.4/ant-antunit-1.4.jar:/srv/gump/public/workspace/mvnlocalrepo/shared/junit/junit/4.12/junit-4.12.jar:/srv/gump/public/workspace/mvnlocalrepo/shared/org/hamcrest/hamcrest-core/1.3/hamcrest-core-1.3.jar:/srv/gump/public/workspace/mvnlocalrepo/shared/org/apache/ant/ant-testutil/1.9.12/ant-testutil-1.9.12.jar" />
[au:antunit]     <pathelement location="/srv/gump/public/workspace/rat/apache-rat-tasks/target/testoutput/dest" />
[au:antunit]   </path>
[au:antunit] 
[au:antunit]   <taskdef uri="antlib:org.apache.ant.antunit" 
[au:antunit]            resource="org/apache/ant/antunit/antlib.xml" 
[au:antunit]            classpathref="all-classes-needed-for-tests"
[au:antunit]            loaderref="testloader"/>
[au:antunit] 
[au:antunit]   <taskdef uri="antlib:org.apache.rat.anttasks"
[au:antunit]            resource="org/apache/rat/anttasks/antlib.xml"

Continuation...

[au:antunit]            classpathref="all-classes-needed-for-tests"
[au:antunit]            loaderref="testloader"/>
[au:antunit] 
[au:antunit]   <target name="setUp">
[au:antunit]     <pathconvert dirsep="/" property="file.name">
[au:antunit]       <path>
[au:antunit]         <pathelement location="/srv/gump/public/workspace/rat/apache-rat-tasks/src/test/resources/antunit/report-normal-operation.xml"/>
[au:antunit]       </path>
[au:antunit] '
[au:antunit] 	took 0.093 sec
[au:antunit] Target: testWithALUnknownSentToFile took 0.074 sec
[au:antunit] Target: testWithReportSentToFile took 0.132 sec
[au:antunit] Target: testCustomMatcherSentToFile  caused an ERROR
[au:antunit] 	at line 333, column 43
[au:antunit] 	Message: Unable to find a javac compiler;
[au:antunit] com.sun.tools.javac.Main is not on the classpath.
[au:antunit] Perhaps JAVA_HOME does not point to the JDK.
[au:antunit] It is currently set to "/usr/lib/jvm/java-8-oracle/jre"
[au:antunit] 	took 0.025 sec
[INFO] ------------------------------------------------------------------------
[INFO] Reactor Summary:
[INFO] 
[INFO] Apache Creadur Rat ................................. SUCCESS [  3.887 s]
[INFO] Apache Creadur Rat::API ............................ SUCCESS [  3.640 s]
[INFO] Apache Creadur Rat::Core ........................... SUCCESS [ 15.416 s]
[INFO] Apache Creadur Rat::Plugin4Maven ................... SUCCESS [  9.007 s]
[INFO] Apache Creadur Rat::Tasks4Ant ...................... FAILURE [  3.970 s]
[INFO] Apache Creadur Rat::Command Line ................... SKIPPED
[INFO] ------------------------------------------------------------------------
[INFO] BUILD FAILURE
[INFO] ------------------------------------------------------------------------
[INFO] Total time: 37.220 s
[INFO] Finished at: 2018-09-18T19:28:34+00:00
[INFO] Final Memory: 48M/367M
[INFO] ------------------------------------------------------------------------
[ERROR] Failed to execute goal org.apache.maven.plugins:maven-antrun-plugin:1.8:run (default) on project apache-rat-tasks: An Ant BuildException has occured: The following error occurred while executing this line:
[ERROR] /srv/gump/public/workspace/rat/apache-rat-tasks/src/test/resources/antunit/report-normal-operation.xml:59: Tests failed with 0 failures and 6 errors
[ERROR] around Ant part ...<ant antfile="src/test/resources/antunit/report-normal-operation.xml" inheritRefs="false" inheritAll="false">... @ 11:112 in /srv/gump/public/workspace/rat/apache-rat-tasks/target/antrun/build-main.xml
[ERROR] -> [Help 1]
[ERROR] 
[ERROR] To see the full stack trace of the errors, re-run Maven with the -e switch.
[ERROR] Re-run Maven using the -X switch to enable full debug logging.
[ERROR] 
[ERROR] For more information about the errors and possible solutions, please read the following articles:
[ERROR] [Help 1] http://cwiki.apache.org/confluence/display/MAVEN/MojoExecutionException
[ERROR] 
[ERROR] After correcting the problems, you can resume the build with the command
[ERROR]   mvn <goals> -rf :apache-rat-tasks

Apache Gump, Gump, Apache, the Apache feather logo, and the Apache Gump project logos are trademarks of The Apache Software Foundation.

Last Updated: Tue, 18 Sep 2018 18:00:06 ().Python Logo