Run| Workspace| Log| Issues| Fixes| Pre-reqs| Stats| XRef| Maven Repository Proxy Log Gump Logo

Details

Parameters

Prefix Name Value
--batch-mode
--settings
/srv/gump/public/workspace/logging-log4j-12/gump_mvn_settings.xml
test

Environment Overrides

Name Value
M2_HOME /opt/maven2

Command Line

/opt/maven2/bin/mvn --batch-mode --settings
        /srv/gump/public/workspace/logging-log4j-12/gump_mvn_settings.xml test 

Output

[INFO] Scanning for projects...
[INFO] ------------------------------------------------------------------------
[INFO] Building Apache Log4j
[INFO]    task-segment: [test]
[INFO] ------------------------------------------------------------------------
[INFO] [antrun:run {execution: javadoc.resources}]
[INFO] Executing tasks
[INFO] Executed tasks
[INFO] [resources:resources {execution: default-resources}]
[INFO] Using 'UTF-8' encoding to copy filtered resources.
[INFO] Copying 3 resources
[INFO] [compiler:compile {execution: default-compile}]
[INFO] Nothing to compile - all classes are up to date
[INFO] [antrun:run {execution: ntdll}]
[INFO] Executing tasks

windres:
     [exec] Execute failed: java.io.IOException: Cannot run program "i586-mingw32msvc-windres" (in directory "/srv/gump/public/workspace/logging-log4j-12/src/ntdll"): error=2, No such file or directory

compile:

windres-echo:
     [echo] i586-mingw32msvc-windres could not be found or failed, NTEventLogAppender.dll build skipped.

jni_md.h-echo:
     [echo] ${env.JNI_WIN32_INCLUDE_DIR}/jni_md.h not found, NTEventLogAppender.dll build skipped.

build:
[INFO] Executed tasks
[INFO] [resources:testResources {execution: default-testResources}]
[INFO] Using 'UTF-8' encoding to copy filtered resources.
[INFO] Copying 12 resources
[INFO] [compiler:testCompile {execution: default-testCompile}]
[INFO] Nothing to compile - all classes are up to date
[INFO] [surefire:test {execution: default-test}]
Downloading: http://localhost:8192/maven2/org/apache/maven/surefire/surefire-junit/2.5/surefire-junit-2.5.pom
1K downloaded  (surefire-junit-2.5.pom)
Downloading: http://localhost:8192/maven2/org/apache/maven/surefire/surefire-providers/2.5/surefire-providers-2.5.pom
1K downloaded  (surefire-providers-2.5.pom)
Downloading: http://localhost:8192/maven2/org/apache/maven/surefire/surefire-junit/2.5/surefire-junit-2.5.jar
15K downloaded  (surefire-junit-2.5.jar)
[INFO] Surefire report directory: /srv/gump/public/workspace/logging-log4j-12/target/surefire-reports

-------------------------------------------------------
 T E S T S
-------------------------------------------------------
Running org.apache.log4j.xml.XMLLayoutTestCase
Tests run: 6, Failures: 0, Errors: 0, Skipped: 0, Time elapsed: 0.201 sec
Running org.apache.log4j.PatternLayoutTestCase
Tests run: 16, Failures: 0, Errors: 0, Skipped: 0, Time elapsed: 0.49 sec
Running org.apache.log4j.helpers.BoundedFIFOTestCase
Tests run: 5, Failures: 0, Errors: 0, Skipped: 0, Time elapsed: 0.094 sec
Running org.apache.log4j.helpers.PatternParserTestCase
Tests run: 1, Failures: 0, Errors: 0, Skipped: 0, Time elapsed: 0.062 sec
Running org.apache.log4j.LogManagerTest
Tests run: 5, Failures: 0, Errors: 0, Skipped: 0, Time elapsed: 0.052 sec
Running org.apache.log4j.MinimumTestCase
Tests run: 2, Failures: 0, Errors: 0, Skipped: 0, Time elapsed: 0.144 sec
Running org.apache.log4j.FileAppenderTest
Tests run: 4, Failures: 0, Errors: 0, Skipped: 0, Time elapsed: 0.059 sec
Running org.apache.log4j.HTMLLayoutTest
Tests run: 13, Failures: 0, Errors: 0, Skipped: 0, Time elapsed: 0.161 sec
Running org.apache.log4j.CategoryTest
Tests run: 5, Failures: 0, Errors: 0, Skipped: 0, Time elapsed: 0.169 sec
Running org.apache.log4j.LoggerTestCase
log4j:WARN No appenders could be found for logger (x).
log4j:WARN Please initialize the log4j system properly.
log4j:WARN See http://logging.apache.org/log4j/1.2/faq.html#noconfig for more info.
Tests run: 18, Failures: 0, Errors: 0, Skipped: 0, Time elapsed: 0.267 sec
Running org.apache.log4j.varia.LevelMatchFilterTestCase
Tests run: 2, Failures: 0, Errors: 0, Skipped: 0, Time elapsed: 0.08 sec
Running org.apache.log4j.PatternLayoutTest
Tests run: 11, Failures: 0, Errors: 0, Skipped: 0, Time elapsed: 0.089 sec
Running org.apache.log4j.HierarchyThresholdTestCase
Tearing down test case.
Tearing down test case.
Tearing down test case.
Tearing down test case.
Tearing down test case.
Tearing down test case.
Tearing down test case.
Tearing down test case.
Tests run: 8, Failures: 0, Errors: 0, Skipped: 0, Time elapsed: 0.121 sec
Running org.apache.log4j.DRFATestCase
log4j:WARN File option not set for appender [testComputeCheckPeriod].
log4j:WARN Are you using FileAppender instead of ConsoleAppender?
log4j:ERROR Either File or DatePattern options are not set for appender [testComputeCheckPeriod].
Month = 1
Month = 3
Month = 5
Month = 7
Month = 8
Month = 10
Month = 12
Month = 3
Month = 10
Month = 1
Month = 5
Month = 7
Month = 8
Month = 12
log4j:WARN Unknown periodicity for appender [null].
log4j:ERROR Either File or DatePattern options are not set for appender [null].
Tests run: 15, Failures: 0, Errors: 0, Skipped: 0, Time elapsed: 69.143 sec
Running org.apache.log4j.LayoutTest
Tests run: 7, Failures: 0, Errors: 0, Skipped: 0, Time elapsed: 0.039 sec
Running org.apache.log4j.helpers.CyclicBufferTestCase
Tests run: 3, Failures: 0, Errors: 0, Skipped: 0, Time elapsed: 0.078 sec
Running org.apache.log4j.varia.ERFATestCase
Tests run: 2, Failures: 0, Errors: 0, Skipped: 0, Time elapsed: 0.166 sec
Running org.apache.log4j.customLogger.XLoggerTestCase
log4j: reset attribute= "false".
log4j: Threshold ="null".
log4j: Level value for root is  [TRACE].
log4j: Desired Level sub-class: [org.apache.log4j.xml.XLevel]
log4j: root level set to TRACE
log4j: Class name: [org.apache.log4j.FileAppender]
log4j: Setting property [append] to [false].
log4j: Setting property [file] to [output/temp].
log4j: Parsing layout of class: "org.apache.log4j.PatternLayout"
log4j: Setting property [conversionPattern] to [%-5p %c{2} - %m%n].
log4j: Setting property [levelToMatch] to [TRACE#org.apache.log4j.xml.XLevel].
log4j: toLevel:class=[org.apache.log4j.xml.XLevel]:pri=[TRACE]
log4j: Setting property [acceptOnMatch] to [true].
log4j: Adding filter of type [class org.apache.log4j.varia.LevelMatchFilter] to appender named [TEMP].
log4j: Adding filter of type [class org.apache.log4j.varia.DenyAllFilter] to appender named [TEMP].
log4j: setFile called: output/temp, false
log4j: setFile ended
log4j: Adding appender named [TEMP] to category [root].
Tests run: 2, Failures: 0, Errors: 0, Skipped: 0, Time elapsed: 0.181 sec
Running org.apache.log4j.PriorityTest
Tests run: 21, Failures: 0, Errors: 0, Skipped: 0, Time elapsed: 0.072 sec
Running org.apache.log4j.PropertyConfiguratorTest
log4j:ERROR Could not read configuration file [output/badescape.properties].
java.lang.IllegalArgumentException: Malformed \uxxxx encoding.
	at java.util.Properties.loadConvert(Properties.java:574)
	at java.util.Properties.load0(Properties.java:391)
	at java.util.Properties.load(Properties.java:341)
	at org.apache.log4j.PropertyConfigurator.doConfigure(PropertyConfigurator.java:373)
	at org.apache.log4j.PropertyConfigurator.configure(PropertyConfigurator.java:403)
	at org.apache.log4j.PropertyConfiguratorTest.testBadUnicodeEscape(PropertyConfiguratorTest.java:58)
	at sun.reflect.NativeMethodAccessorImpl.invoke0(Native Method)
	at sun.reflect.NativeMethodAccessorImpl.invoke(NativeMethodAccessorImpl.java:62)
	at sun.reflect.DelegatingMethodAccessorImpl.invoke(DelegatingMethodAccessorImpl.java:43)
	at java.lang.reflect.Method.invoke(Method.java:498)
	at junit.framework.TestCase.runTest(TestCase.java:164)
	at junit.framework.TestCase.runBare(TestCase.java:130)
	at junit.framework.TestResult$1.protect(TestResult.java:106)
	at junit.framework.TestResult.runProtected(TestResult.java:124)
	at junit.framework.TestResult.run(TestResult.java:109)
	at junit.framework.TestCase.run(TestCase.java:120)
	at junit.framework.TestSuite.runTest(TestSuite.java:230)
	at junit.framework.TestSuite.run(TestSuite.java:225)
	at sun.reflect.NativeMethodAccessorImpl.invoke0(Native Method)
	at sun.reflect.NativeMethodAccessorImpl.invoke(NativeMethodAccessorImpl.java:62)
	at sun.reflect.DelegatingMethodAccessorImpl.invoke(DelegatingMethodAccessorImpl.java:43)
	at java.lang.reflect.Method.invoke(Method.java:498)
	at org.apache.maven.surefire.junit.JUnitTestSet.execute(JUnitTestSet.java:213)
	at org.apache.maven.surefire.suite.AbstractDirectoryTestSuite.executeTestSet(AbstractDirectoryTestSuite.java:115)
	at org.apache.maven.surefire.suite.AbstractDirectoryTestSuite.execute(AbstractDirectoryTestSuite.java:140)
	at org.apache.maven.surefire.Surefire.run(Surefire.java:109)
	at sun.reflect.NativeMethodAccessorImpl.invoke0(Native Method)
	at sun.reflect.NativeMethodAccessorImpl.invoke(NativeMethodAccessorImpl.java:62)
	at sun.reflect.DelegatingMethodAccessorImpl.invoke(DelegatingMethodAccessorImpl.java:43)
	at java.lang.reflect.Method.invoke(Method.java:498)
	at org.apache.maven.surefire.booter.SurefireBooter.runSuitesInProcess(SurefireBooter.java:290)
	at org.apache.maven.surefire.booter.SurefireBooter.main(SurefireBooter.java:1017)
log4j:ERROR Ignoring configuration file [output/badescape.properties].
log4j:ERROR Could not read configuration file from URL [file:/srv/gump/public/workspace/logging-log4j-12/tests/output/urlbadescape.properties].
java.lang.IllegalArgumentException: Malformed \uxxxx encoding.
	at java.util.Properties.loadConvert(Properties.java:574)
	at java.util.Properties.load0(Properties.java:391)
	at java.util.Properties.load(Properties.java:341)
	at org.apache.log4j.PropertyConfigurator.doConfigure(PropertyConfigurator.java:559)
	at org.apache.log4j.PropertyConfigurator.configure(PropertyConfigurator.java:415)
	at org.apache.log4j.PropertyConfiguratorTest.testURLBadEscape(PropertyConfiguratorTest.java:92)
	at sun.reflect.NativeMethodAccessorImpl.invoke0(Native Method)
	at sun.reflect.NativeMethodAccessorImpl.invoke(NativeMethodAccessorImpl.java:62)
	at sun.reflect.DelegatingMethodAccessorImpl.invoke(DelegatingMethodAccessorImpl.java:43)
	at java.lang.reflect.Method.invoke(Method.java:498)
	at junit.framework.TestCase.runTest(TestCase.java:164)
	at junit.framework.TestCase.runBare(TestCase.java:130)
	at junit.framework.TestResult$1.protect(TestResult.java:106)
	at junit.framework.TestResult.runProtected(TestResult.java:124)
	at junit.framework.TestResult.run(TestResult.java:109)
	at junit.framework.TestCase.run(TestCase.java:120)
	at junit.framework.TestSuite.runTest(TestSuite.java:230)
	at junit.framework.TestSuite.run(TestSuite.java:225)
	at sun.reflect.NativeMethodAccessorImpl.invoke0(Native Method)
	at sun.reflect.NativeMethodAccessorImpl.invoke(NativeMethodAccessorImpl.java:62)
	at sun.reflect.DelegatingMethodAccessorImpl.invoke(DelegatingMethodAccessorImpl.java:43)
	at java.lang.reflect.Method.invoke(Method.java:498)
	at org.apache.maven.surefire.junit.JUnitTestSet.execute(JUnitTestSet.java:213)
	at org.apache.maven.surefire.suite.AbstractDirectoryTestSuite.executeTestSet(AbstractDirectoryTestSuite.java:115)
	at org.apache.maven.surefire.suite.AbstractDirectoryTestSuite.execute(AbstractDirectoryTestSuite.java:140)
	at org.apache.maven.surefire.Surefire.run(Surefire.java:109)
	at sun.reflect.NativeMethodAccessorImpl.invoke0(Native Method)
	at sun.reflect.NativeMethodAccessorImpl.invoke(NativeMethodAccessorImpl.java:62)
	at sun.reflect.DelegatingMethodAccessorImpl.invoke(DelegatingMethodAccessorImpl.java:43)
	at java.lang.reflect.Method.invoke(Method.java:498)
	at org.apache.maven.surefire.booter.SurefireBooter.runSuitesInProcess(SurefireBooter.java:290)
	at org.apache.maven.surefire.booter.SurefireBooter.main(SurefireBooter.java:1017)
log4j:ERROR Ignoring configuration file [file:/srv/gump/public/workspace/logging-log4j-12/tests/output/urlbadescape.properties].
Tests run: 8, Failures: 0, Errors: 0, Skipped: 0, Time elapsed: 0.098 sec
Running org.apache.log4j.xml.CustomLevelTestCase
log4j: reset attribute= "false".
log4j: Threshold ="null".
log4j: Level value for root is  [TRACE#org.apache.log4j.xml.XLevel].
log4j: toLevel:class=[org.apache.log4j.xml.XLevel]:pri=[TRACE]
log4j: root level set to TRACE
log4j: Class name: [org.apache.log4j.FileAppender]
log4j: Setting property [append] to [false].
log4j: Setting property [file] to [output/temp].
log4j: Parsing layout of class: "org.apache.log4j.PatternLayout"
log4j: Setting property [conversionPattern] to [%-5p %c{2} - %m
].
log4j: setFile called: output/temp, false
log4j: setFile ended
log4j: Adding appender named [TEMP] to category [root].
Tests run: 4, Failures: 0, Errors: 0, Skipped: 0, Time elapsed: 0.179 sec
Running org.apache.log4j.LevelTest
Tests run: 24, Failures: 0, Errors: 0, Skipped: 0, Time elapsed: 0.142 sec
Running org.apache.log4j.xml.DOMTestCase
/srv/gump/public/workspace/logging-log4j-12/tests/input/xml/defaultInit.xml
log4j: reset attribute= "false".
log4j: Threshold ="null".
log4j: Level value for root is  [OFF].
log4j: root level set to OFF
log4j: Class name: [org.apache.log4j.ConsoleAppender]
log4j: Parsing layout of class: "org.apache.log4j.PatternLayout"
log4j: Setting property [conversionPattern] to [%-5p %c{2} - %m%n].
log4j: Adding appender named [D1] to category [root].
Tests run: 10, Failures: 0, Errors: 0, Skipped: 0, Time elapsed: 0.367 sec
Running org.apache.log4j.RFATestCase
Tests run: 6, Failures: 0, Errors: 0, Skipped: 0, Time elapsed: 0.118 sec
Running org.apache.log4j.or.ORTestCase
Tests run: 10, Failures: 0, Errors: 0, Skipped: 0, Time elapsed: 0.034 sec
Running org.apache.log4j.TTCCLayoutTest
Tests run: 30, Failures: 0, Errors: 0, Skipped: 0, Time elapsed: 0.111 sec

Results :

Tests run: 238, Failures: 0, Errors: 0, Skipped: 0

[INFO] ------------------------------------------------------------------------
[INFO] BUILD SUCCESSFUL
[INFO] ------------------------------------------------------------------------
[INFO] Total time: 1 minute 23 seconds
[INFO] Finished at: Tue Dec 12 00:14:08 UTC 2017
[INFO] Final Memory: 32M/298M
[INFO] ------------------------------------------------------------------------

Apache Gump, Gump, Apache, the Apache feather logo, and the Apache Gump project logos are trademarks of The Apache Software Foundation.

Last Updated: Tue, 12 Dec 2017 00:00:11 ().Python Logo