Run| Workspace| Log| Issues| Fixes| Pre-reqs| Stats| XRef| Maven Repository Proxy Log Gump Logo

Details

Parameters

Prefix Name Value
--debug
-D java.awt.headless true
-D build.sysclasspath only
-D sun.zip.disableMemoryMapping true
-Dmaven.repo.local=/srv/gump/public/workspace/mvnlocalrepo/java-hamcrest.mvnlocalrepo
--refresh-dependencies
--init-script
/srv/gump/public/workspace/java-hamcrest/gump_init_script.gradle
build

Command Line

gradle --debug -Djava.awt.headless=true -Dbuild.sysclasspath=only
        -Dsun.zip.disableMemoryMapping=true
        -Dmaven.repo.local=/srv/gump/public/workspace/mvnlocalrepo/java-hamcrest.mvnlocalrepo
        --refresh-dependencies --init-script
        /srv/gump/public/workspace/java-hamcrest/gump_init_script.gradle build 

Output

00:20:21.330 [INFO] [org.gradle.BuildLogger] Starting Build
00:20:21.336 [DEBUG] [org.gradle.BuildLogger] Gradle user home: /home/gump/.gradle
00:20:21.336 [DEBUG] [org.gradle.BuildLogger] Current dir: /srv/gump/public/workspace/java-hamcrest
00:20:21.337 [DEBUG] [org.gradle.BuildLogger] Settings file: null
00:20:21.338 [DEBUG] [org.gradle.BuildLogger] Build file: null
00:20:21.396 [DEBUG] [org.gradle.internal.remote.internal.inet.InetAddressFactory] Adding IP addresses for network interface eth0
00:20:21.398 [DEBUG] [org.gradle.internal.remote.internal.inet.InetAddressFactory] Is this a loopback interface? false
00:20:21.399 [DEBUG] [org.gradle.internal.remote.internal.inet.InetAddressFactory] Is this a multicast interface? true
00:20:21.400 [DEBUG] [org.gradle.internal.remote.internal.inet.InetAddressFactory] Adding remote address /fe80:0:0:0:0:3ff:feef:12%eth0
00:20:21.401 [DEBUG] [org.gradle.internal.remote.internal.inet.InetAddressFactory] Adding remote address /10.20.2.14
00:20:21.403 [DEBUG] [org.gradle.internal.remote.internal.inet.InetAddressFactory] Adding remote multicast interface eth0
00:20:21.404 [DEBUG] [org.gradle.internal.remote.internal.inet.InetAddressFactory] Adding IP addresses for network interface lo
00:20:21.404 [DEBUG] [org.gradle.internal.remote.internal.inet.InetAddressFactory] Is this a loopback interface? true
00:20:21.406 [DEBUG] [org.gradle.internal.remote.internal.inet.InetAddressFactory] Is this a multicast interface? false
00:20:21.407 [DEBUG] [org.gradle.internal.remote.internal.inet.InetAddressFactory] Adding loopback address /0:0:0:0:0:0:0:1%lo
00:20:21.409 [DEBUG] [org.gradle.internal.remote.internal.inet.InetAddressFactory] Adding loopback address /127.0.0.1
00:20:21.418 [DEBUG] [org.gradle.cache.internal.DefaultFileLockManager] Waiting to acquire shared lock on cp_init remapped class cache for 4inotkpybovivni92xas1pf2v (/home/gump/.gradle/caches/2.14.1/scripts-remapped/gump_init_script_12yx9mtnnuqfgx94h66zzd6bx/4inotkpybovivni92xas1pf2v/cp_init57408229).
00:20:21.419 [DEBUG] [org.gradle.cache.internal.DefaultFileLockManager] Lock acquired.
00:20:21.420 [DEBUG] [org.gradle.cache.internal.DefaultPersistentDirectoryCache] Invalidating cp_init remapped class cache for 4inotkpybovivni92xas1pf2v (/home/gump/.gradle/caches/2.14.1/scripts-remapped/gump_init_script_12yx9mtnnuqfgx94h66zzd6bx/4inotkpybovivni92xas1pf2v/cp_init57408229) as it was not closed cleanly.
00:20:21.422 [DEBUG] [org.gradle.cache.internal.DefaultFileLockManager] Releasing lock on cp_init remapped class cache for 4inotkpybovivni92xas1pf2v (/home/gump/.gradle/caches/2.14.1/scripts-remapped/gump_init_script_12yx9mtnnuqfgx94h66zzd6bx/4inotkpybovivni92xas1pf2v/cp_init57408229).
00:20:21.423 [DEBUG] [org.gradle.cache.internal.DefaultFileLockManager] Waiting to acquire exclusive lock on cp_init remapped class cache for 4inotkpybovivni92xas1pf2v (/home/gump/.gradle/caches/2.14.1/scripts-remapped/gump_init_script_12yx9mtnnuqfgx94h66zzd6bx/4inotkpybovivni92xas1pf2v/cp_init57408229).
00:20:21.424 [DEBUG] [org.gradle.cache.internal.DefaultFileLockManager] Lock acquired.
00:20:21.425 [DEBUG] [org.gradle.cache.internal.DefaultPersistentDirectoryCache] Invalidating cp_init remapped class cache for 4inotkpybovivni92xas1pf2v (/home/gump/.gradle/caches/2.14.1/scripts-remapped/gump_init_script_12yx9mtnnuqfgx94h66zzd6bx/4inotkpybovivni92xas1pf2v/cp_init57408229) as it was not closed cleanly.
00:20:21.431 [DEBUG] [org.gradle.cache.internal.DefaultFileLockManager] Waiting to acquire shared lock on cp_init generic class cache for initialization script '/srv/gump/public/workspace/java-hamcrest/gump_init_script.gradle' (/home/gump/.gradle/caches/2.14.1/scripts/4inotkpybovivni92xas1pf2v/cp_init/cp_init57408229).
00:20:21.432 [DEBUG] [org.gradle.cache.internal.DefaultFileLockManager] Lock acquired.
00:20:21.432 [DEBUG] [org.gradle.cache.internal.DefaultPersistentDirectoryCache] Invalidating cp_init generic class cache for initialization script '/srv/gump/public/workspace/java-hamcrest/gump_init_script.gradle' (/home/gump/.gradle/caches/2.14.1/scripts/4inotkpybovivni92xas1pf2v/cp_init/cp_init57408229) as it was not closed cleanly.
00:20:21.432 [DEBUG] [org.gradle.cache.internal.DefaultFileLockManager] Releasing lock on cp_init generic class cache for initialization script '/srv/gump/public/workspace/java-hamcrest/gump_init_script.gradle' (/home/gump/.gradle/caches/2.14.1/scripts/4inotkpybovivni92xas1pf2v/cp_init/cp_init57408229).
00:20:21.433 [DEBUG] [org.gradle.cache.internal.DefaultFileLockManager] Waiting to acquire exclusive lock on cp_init generic class cache for initialization script '/srv/gump/public/workspace/java-hamcrest/gump_init_script.gradle' (/home/gump/.gradle/caches/2.14.1/scripts/4inotkpybovivni92xas1pf2v/cp_init/cp_init57408229).
00:20:21.434 [DEBUG] [org.gradle.cache.internal.DefaultFileLockManager] Lock acquired.
00:20:21.434 [DEBUG] [org.gradle.cache.internal.DefaultPersistentDirectoryCache] Invalidating cp_init generic class cache for initialization script '/srv/gump/public/workspace/java-hamcrest/gump_init_script.gradle' (/home/gump/.gradle/caches/2.14.1/scripts/4inotkpybovivni92xas1pf2v/cp_init/cp_init57408229) as it was not closed cleanly.
00:20:21.440 [INFO] [org.gradle.groovy.scripts.internal.DefaultScriptCompilationHandler] Compiling initialization script '/srv/gump/public/workspace/java-hamcrest/gump_init_script.gradle' using SubsetScriptTransformer.
00:20:21.948 [DEBUG] [org.gradle.groovy.scripts.internal.DefaultScriptCompilationHandler] Timing: Writing script to cache at /home/gump/.gradle/caches/2.14.1/scripts/4inotkpybovivni92xas1pf2v/cp_init/cp_init57408229/classes took: 0.509 secs
00:20:21.956 [DEBUG] [org.gradle.cache.internal.DefaultFileLockManager] Releasing lock on cp_init generic class cache for initialization script '/srv/gump/public/workspace/java-hamcrest/gump_init_script.gradle' (/home/gump/.gradle/caches/2.14.1/scripts/4inotkpybovivni92xas1pf2v/cp_init/cp_init57408229).
00:20:21.957 [DEBUG] [org.gradle.cache.internal.DefaultFileLockManager] Waiting to acquire shared lock on cp_init generic class cache for initialization script '/srv/gump/public/workspace/java-hamcrest/gump_init_script.gradle' (/home/gump/.gradle/caches/2.14.1/scripts/4inotkpybovivni92xas1pf2v/cp_init/cp_init57408229).
00:20:21.958 [DEBUG] [org.gradle.cache.internal.DefaultFileLockManager] Lock acquired.
00:20:21.959 [DEBUG] [org.gradle.cache.internal.DefaultFileLockManager] Releasing lock on cp_init generic class cache for initialization script '/srv/gump/public/workspace/java-hamcrest/gump_init_script.gradle' (/home/gump/.gradle/caches/2.14.1/scripts/4inotkpybovivni92xas1pf2v/cp_init/cp_init57408229).
00:20:21.964 [DEBUG] [org.gradle.cache.internal.DefaultFileLockManager] Releasing lock on cp_init remapped class cache for 4inotkpybovivni92xas1pf2v (/home/gump/.gradle/caches/2.14.1/scripts-remapped/gump_init_script_12yx9mtnnuqfgx94h66zzd6bx/4inotkpybovivni92xas1pf2v/cp_init57408229).
00:20:21.965 [DEBUG] [org.gradle.cache.internal.DefaultFileLockManager] Waiting to acquire shared lock on cp_init remapped class cache for 4inotkpybovivni92xas1pf2v (/home/gump/.gradle/caches/2.14.1/scripts-remapped/gump_init_script_12yx9mtnnuqfgx94h66zzd6bx/4inotkpybovivni92xas1pf2v/cp_init57408229).
00:20:21.966 [DEBUG] [org.gradle.cache.internal.DefaultFileLockManager] Lock acquired.
00:20:21.967 [DEBUG] [org.gradle.cache.internal.DefaultFileLockManager] Releasing lock on cp_init remapped class cache for 4inotkpybovivni92xas1pf2v (/home/gump/.gradle/caches/2.14.1/scripts-remapped/gump_init_script_12yx9mtnnuqfgx94h66zzd6bx/4inotkpybovivni92xas1pf2v/cp_init57408229).
00:20:21.998 [DEBUG] [org.gradle.cache.internal.DefaultFileLockManager] Waiting to acquire shared lock on init remapped class cache for 4inotkpybovivni92xas1pf2v (/home/gump/.gradle/caches/2.14.1/scripts-remapped/gump_init_script_12yx9mtnnuqfgx94h66zzd6bx/4inotkpybovivni92xas1pf2v/init57408229).
00:20:21.999 [DEBUG] [org.gradle.cache.internal.DefaultFileLockManager] Lock acquired.
00:20:22.000 [DEBUG] [org.gradle.cache.internal.DefaultPersistentDirectoryCache] Invalidating init remapped class cache for 4inotkpybovivni92xas1pf2v (/home/gump/.gradle/caches/2.14.1/scripts-remapped/gump_init_script_12yx9mtnnuqfgx94h66zzd6bx/4inotkpybovivni92xas1pf2v/init57408229) as it was not closed cleanly.
00:20:22.000 [DEBUG] [org.gradle.cache.internal.DefaultFileLockManager] Releasing lock on init remapped class cache for 4inotkpybovivni92xas1pf2v (/home/gump/.gradle/caches/2.14.1/scripts-remapped/gump_init_script_12yx9mtnnuqfgx94h66zzd6bx/4inotkpybovivni92xas1pf2v/init57408229).
00:20:22.004 [DEBUG] [org.gradle.cache.internal.DefaultFileLockManager] Waiting to acquire exclusive lock on init remapped class cache for 4inotkpybovivni92xas1pf2v (/home/gump/.gradle/caches/2.14.1/scripts-remapped/gump_init_script_12yx9mtnnuqfgx94h66zzd6bx/4inotkpybovivni92xas1pf2v/init57408229).
00:20:22.004 [DEBUG] [org.gradle.cache.internal.DefaultFileLockManager] Lock acquired.
00:20:22.004 [DEBUG] [org.gradle.cache.internal.DefaultPersistentDirectoryCache] Invalidating init remapped class cache for 4inotkpybovivni92xas1pf2v (/home/gump/.gradle/caches/2.14.1/scripts-remapped/gump_init_script_12yx9mtnnuqfgx94h66zzd6bx/4inotkpybovivni92xas1pf2v/init57408229) as it was not closed cleanly.
00:20:22.006 [DEBUG] [org.gradle.cache.internal.DefaultFileLockManager] Waiting to acquire shared lock on init generic class cache for initialization script '/srv/gump/public/workspace/java-hamcrest/gump_init_script.gradle' (/home/gump/.gradle/caches/2.14.1/scripts/4inotkpybovivni92xas1pf2v/init/init57408229).
00:20:22.010 [DEBUG] [org.gradle.cache.internal.DefaultFileLockManager] Lock acquired.
00:20:22.011 [DEBUG] [org.gradle.cache.internal.DefaultPersistentDirectoryCache] Invalidating init generic class cache for initialization script '/srv/gump/public/workspace/java-hamcrest/gump_init_script.gradle' (/home/gump/.gradle/caches/2.14.1/scripts/4inotkpybovivni92xas1pf2v/init/init57408229) as it was not closed cleanly.
00:20:22.011 [DEBUG] [org.gradle.cache.internal.DefaultFileLockManager] Releasing lock on init generic class cache for initialization script '/srv/gump/public/workspace/java-hamcrest/gump_init_script.gradle' (/home/gump/.gradle/caches/2.14.1/scripts/4inotkpybovivni92xas1pf2v/init/init57408229).
00:20:22.011 [DEBUG] [org.gradle.cache.internal.DefaultFileLockManager] Waiting to acquire exclusive lock on init generic class cache for initialization script '/srv/gump/public/workspace/java-hamcrest/gump_init_script.gradle' (/home/gump/.gradle/caches/2.14.1/scripts/4inotkpybovivni92xas1pf2v/init/init57408229).
00:20:22.012 [DEBUG] [org.gradle.cache.internal.DefaultFileLockManager] Lock acquired.
00:20:22.012 [DEBUG] [org.gradle.cache.internal.DefaultPersistentDirectoryCache] Invalidating init generic class cache for initialization script '/srv/gump/public/workspace/java-hamcrest/gump_init_script.gradle' (/home/gump/.gradle/caches/2.14.1/scripts/4inotkpybovivni92xas1pf2v/init/init57408229) as it was not closed cleanly.
00:20:22.013 [INFO] [org.gradle.groovy.scripts.internal.DefaultScriptCompilationHandler] Compiling initialization script '/srv/gump/public/workspace/java-hamcrest/gump_init_script.gradle' using BuildScriptTransformer.
00:20:22.367 [DEBUG] [org.gradle.groovy.scripts.internal.DefaultScriptCompilationHandler] Timing: Writing script to cache at /home/gump/.gradle/caches/2.14.1/scripts/4inotkpybovivni92xas1pf2v/init/init57408229/classes took: 0.355 secs
00:20:22.368 [DEBUG] [org.gradle.cache.internal.DefaultFileLockManager] Releasing lock on init generic class cache for initialization script '/srv/gump/public/workspace/java-hamcrest/gump_init_script.gradle' (/home/gump/.gradle/caches/2.14.1/scripts/4inotkpybovivni92xas1pf2v/init/init57408229).
00:20:22.368 [DEBUG] [org.gradle.cache.internal.DefaultFileLockManager] Waiting to acquire shared lock on init generic class cache for initialization script '/srv/gump/public/workspace/java-hamcrest/gump_init_script.gradle' (/home/gump/.gradle/caches/2.14.1/scripts/4inotkpybovivni92xas1pf2v/init/init57408229).
00:20:22.368 [DEBUG] [org.gradle.cache.internal.DefaultFileLockManager] Lock acquired.
00:20:22.368 [DEBUG] [org.gradle.cache.internal.DefaultFileLockManager] Releasing lock on init generic class cache for initialization script '/srv/gump/public/workspace/java-hamcrest/gump_init_script.gradle' (/home/gump/.gradle/caches/2.14.1/scripts/4inotkpybovivni92xas1pf2v/init/init57408229).
00:20:22.396 [DEBUG] [org.gradle.cache.internal.DefaultFileLockManager] Releasing lock on init remapped class cache for 4inotkpybovivni92xas1pf2v (/home/gump/.gradle/caches/2.14.1/scripts-remapped/gump_init_script_12yx9mtnnuqfgx94h66zzd6bx/4inotkpybovivni92xas1pf2v/init57408229).
00:20:22.398 [DEBUG] [org.gradle.cache.internal.DefaultFileLockManager] Waiting to acquire shared lock on init remapped class cache for 4inotkpybovivni92xas1pf2v (/home/gump/.gradle/caches/2.14.1/scripts-remapped/gump_init_script_12yx9mtnnuqfgx94h66zzd6bx/4inotkpybovivni92xas1pf2v/init57408229).
00:20:22.401 [DEBUG] [org.gradle.cache.internal.DefaultFileLockManager] Lock acquired.
00:20:22.402 [DEBUG] [org.gradle.cache.internal.DefaultFileLockManager] Releasing lock on init remapped class cache for 4inotkpybovivni92xas1pf2v (/home/gump/.gradle/caches/2.14.1/scripts-remapped/gump_init_script_12yx9mtnnuqfgx94h66zzd6bx/4inotkpybovivni92xas1pf2v/init57408229).
00:20:22.681 [DEBUG] [org.gradle.initialization.buildsrc.BuildSourceBuilder] Starting to build the build sources.
00:20:22.682 [DEBUG] [org.gradle.initialization.buildsrc.BuildSourceBuilder] Gradle source dir does not exist. We leave.
00:20:22.682 [DEBUG] [org.gradle.initialization.DefaultGradlePropertiesLoader] Found env project properties: []
00:20:22.683 [DEBUG] [org.gradle.initialization.DefaultGradlePropertiesLoader] Found system project properties: []
00:20:22.698 [DEBUG] [org.gradle.cache.internal.DefaultFileLockManager] Waiting to acquire shared lock on cp_settings remapped class cache for eendqxhfyb9pdbsr07ddz2dbt (/home/gump/.gradle/caches/2.14.1/scripts-remapped/settings_3zs6mr5f4qq49n5mpvcvec71o/eendqxhfyb9pdbsr07ddz2dbt/cp_settings57408229).
00:20:22.700 [DEBUG] [org.gradle.cache.internal.DefaultFileLockManager] Lock acquired.
00:20:22.703 [DEBUG] [org.gradle.cache.internal.DefaultFileLockManager] Releasing lock on cp_settings remapped class cache for eendqxhfyb9pdbsr07ddz2dbt (/home/gump/.gradle/caches/2.14.1/scripts-remapped/settings_3zs6mr5f4qq49n5mpvcvec71o/eendqxhfyb9pdbsr07ddz2dbt/cp_settings57408229).
00:20:22.706 [DEBUG] [org.gradle.cache.internal.DefaultFileLockManager] Waiting to acquire shared lock on settings remapped class cache for eendqxhfyb9pdbsr07ddz2dbt (/home/gump/.gradle/caches/2.14.1/scripts-remapped/settings_3zs6mr5f4qq49n5mpvcvec71o/eendqxhfyb9pdbsr07ddz2dbt/settings57408229).
00:20:22.707 [DEBUG] [org.gradle.cache.internal.DefaultFileLockManager] Lock acquired.
00:20:22.708 [DEBUG] [org.gradle.cache.internal.DefaultFileLockManager] Releasing lock on settings remapped class cache for eendqxhfyb9pdbsr07ddz2dbt (/home/gump/.gradle/caches/2.14.1/scripts-remapped/settings_3zs6mr5f4qq49n5mpvcvec71o/eendqxhfyb9pdbsr07ddz2dbt/settings57408229).
00:20:22.756 [ERROR] [org.gradle.BuildExceptionReporter] 
00:20:22.757 [ERROR] [org.gradle.BuildExceptionReporter] FAILURE: Build failed with an exception.
00:20:22.757 [ERROR] [org.gradle.BuildExceptionReporter] 
00:20:22.757 [ERROR] [org.gradle.BuildExceptionReporter] * Where:
00:20:22.758 [ERROR] [org.gradle.BuildExceptionReporter] Settings file '/srv/gump/public/workspace/java-hamcrest/settings.gradle' line: 1
00:20:22.758 [ERROR] [org.gradle.BuildExceptionReporter] 
00:20:22.760 [ERROR] [org.gradle.BuildExceptionReporter] * What went wrong:
00:20:22.762 [ERROR] [org.gradle.BuildExceptionReporter] A problem occurred evaluating settings 'java-hamcrest'.
00:20:22.762 [ERROR] [org.gradle.BuildExceptionReporter] > Could not find method enableFeaturePreview() for arguments [STABLE_PUBLISHING] on settings 'java-hamcrest' of type org.gradle.initialization.DefaultSettings.
00:20:22.762 [ERROR] [org.gradle.BuildExceptionReporter] 
00:20:22.762 [ERROR] [org.gradle.BuildExceptionReporter] * Try:
00:20:22.762 [ERROR] [org.gradle.BuildExceptionReporter] Run with --stacktrace option to get the stack trace. 
00:20:22.763 [LIFECYCLE] [org.gradle.BuildResultLogger] 
00:20:22.765 [LIFECYCLE] [org.gradle.BuildResultLogger] BUILD FAILED
00:20:22.765 [LIFECYCLE] [org.gradle.BuildResultLogger] 
00:20:22.765 [LIFECYCLE] [org.gradle.BuildResultLogger] Total time: 5.27 secs
00:20:22.768 [DEBUG] [org.gradle.cache.internal.DefaultCacheAccess] Cache Plugin Resolution Cache (/home/gump/.gradle/caches/2.14.1/plugin-resolution) was closed 0 times.

Apache Gump, Gump, Apache, the Apache feather logo, and the Apache Gump project logos are trademarks of The Apache Software Foundation.

Last Updated: Wed, 14 Nov 2018 00:00:07 ().Python Logo